program: Gaussian 09
title: 000131358
version: EM64L-G09RevD.01
frameworkgroup: C1[X(C14H5F4N5O4S)]
method: RPBEPBE
basis: SDD
operation: Freq
keyword: #p
keyword: freq=noraman
keyword: PBEPBE/SDD
title: #p freq=noraman PBEPBE/SDD
converged: YES YES NO NO
title: Mulliken charges:
elementType: S F F F F O O O O N N N N N C C C C C C C C C C C C C C H H H H H
charge: 0.360939 -0.117764 -0.158932 -0.138252 -0.159678 -0.170665 -0.179684 -0.180339 -0.190535 -0.126299 0.056389 -0.003002 0.027145 -0.009224 -0.501319 -0.501360 0.220922 0.222016 0.365238 -0.370741 0.247460 0.050571 0.107396 0.170312 0.081430 0.185629 -0.623137 -0.055310 0.270038 0.270224 0.270123 0.270193 0.310216
chargesum: 0.00000
title: Mulliken charges with hydrogens summed into heavy atoms:
elementType: S F F F F O O O O N N N N N C C C C C C C C C C C C C C
charge: 0.360939 -0.117764 -0.158932 -0.138252 -0.159678 -0.170665 -0.179684 -0.180339 -0.190535 -0.126299 0.056389 -0.003002 0.027145 -0.009224 0.038943 0.038956 0.220922 0.222016 0.365238 -0.370741 0.247460 0.050571 0.107396 0.170312 0.081430 0.185629 -0.312921 -0.055310
polarizability: 3.94036138e+02 -5.38740451e+01 2.68903192e+02 1.38757633e+00 3.12000500e-01 1.27294067e+02
1716.lowfreq: -8.9783 -4.4113 -3.0038 -0.0012 -0.0012 -0.0007 2.3369 14.5671 26.9502
frequency: -4.2098 14.3865 26.8699 29.6364 36.7426 57.7261 71.5867 75.7131 79.3675 105.2160 108.4838 116.6621 131.0661 135.9572 159.6279 196.1810 221.1087 242.6487 251.1283 264.7058 267.7463 287.8389 301.7169 307.9255 329.9805 330.9707 369.8408 377.5424 379.4352 424.1742 444.2631 450.1305 485.8841 496.3142 513.0984 533.3113 548.9119 549.7277 563.6232 573.4583 600.0936 613.8995 625.2234 633.2534 663.8176 669.5098 708.1187 718.1146 759.7956 774.0112 793.5215 804.1030 818.1472 833.7983 868.8060 918.3663 932.6120 990.9171 1006.0811 1009.6037 1015.9172 1033.3426 1062.6120 1070.7059 1147.3191 1157.4611 1164.1427 1209.7233 1216.1475 1229.1518 1287.5950 1291.6806 1293.8245 1317.4519 1363.2687 1382.0159 1436.9541 1438.0766 1452.7724 1463.8803 1474.2174 1521.9767 1552.9595 1621.7924 1665.8536 1678.9823 1721.0192 2066.4486 3030.0237 3038.9432 3085.0077 3102.1512 3244.7057
redmass: 12.6891 9.5407 9.8007 7.5863 12.1757 7.8754 13.4070 5.9990 2.1775 10.7688 10.7753 18.3709 14.3091 14.8943 15.3201 11.9964 15.3973 8.4314 13.9609 12.7906 16.7531 17.8853 14.1549 16.3234 10.4647 13.9626 11.1395 11.5476 10.4313 15.9312 14.6303 13.7958 15.8261 11.3638 7.4512 3.6046 4.1369 3.4368 8.3779 13.8690 11.5300 14.3225 12.0624 6.3183 9.2600 11.5164 10.7456 4.8529 13.1090 12.4924 11.6745 6.9076 1.4900 1.4628 8.1579 12.6675 12.8963 3.4479 2.1867 3.2840 5.5256 4.6441 12.4832 12.7816 1.1951 1.9327 11.7418 1.1093 9.1895 3.0824 8.4558 2.4645 1.5011 9.4046 12.0023 12.4339 1.0737 12.2805 1.0899 8.9367 11.1775 12.0455 11.9769 12.0173 12.6703 12.9694 12.6840 13.9901 1.0593 1.0629 1.1038 1.1020 1.0957
irintensity: 0.0075 0.1216 3.3462 0.7409 0.0298 0.6397 0.0766 5.2966 0.2155 1.5389 5.6885 0.0028 0.2446 0.6595 0.1361 0.7105 0.4460 5.2076 6.5263 2.6439 0.4612 0.9126 0.0788 3.1075 6.8386 3.8492 0.0573 0.2046 21.7172 0.2143 5.8508 1.3731 1.9336 1.5677 0.6515 0.0468 1.0661 0.5407 18.4362 36.3920 1.1954 5.4782 0.2354 55.5624 1.9447 1.8761 30.1094 16.9603 42.6389 11.4219 0.4726 94.3121 18.6913 32.7387 106.7206 51.5876 67.4803 133.9597 0.2513 136.7451 4.5736 64.0894 8.8393 31.4027 1.4863 122.8599 232.2028 0.0562 74.5350 82.4329 6.1771 52.0490 3.8591 22.8935 36.0206 44.0960 0.7827 173.5959 27.9922 54.8951 254.3113 29.6620 41.2490 104.0203 585.3202 239.9287 20.8099 808.8209 11.3184 2.0125 0.0041 4.9194 19.8154
temp: 298.150 k
press: 1.00000 atm
elementType: 16 9 9 9 9 8 8 8 8 7 7 7 7 7 6 6 6 6 6 6 6 6 6 6 6 6 6 6 1 1 1 1 1
symmnumber: 1
zpe: 481141.8 jmol-1
zpe.correction: 0.183257 hartree
zpe.thermalcorrener: 0.207538 hartree
zpe.thermalcorrenthalpy: 0.208482 hartree
zpe.thermalcorrgfe: 0.125928 hartree
zpe.sumelectzpe: -1906.471162 hartree
zpe.sumelectthermal: -1906.446882 hartree
zpe.sumelectthermalent: -1906.445938 hartree
zpe.sumelectthermalfe: -1906.528491 hartree
dipole: -1.1709 0.3263 0.0180
dipole: 1.2156
quadrupole: -139.8671 -159.3685 -175.2629
quadrupole: 10.0293 -0.8436 -1.0633
quadrupole: 18.2991 -1.2023 -17.0968 10.0293 -0.8436 -1.0633
hfenergy: -1906.6544197 hartree
pointgroup: C01 [X(C14H5F4N5O4S1)]
dipole: 0.4626671 -0.0363081 0.1155614 debye
polarizability: 395.8660729|-18.6337143|149.9583717|48.2351416|-51.5032511|244.4089517 unknown
InChI: InChI=1S/C14H5F4N5O4S/c15-8-7(9(16)11(18)12(10(8)17)21-22-19)13-20-4(3-28-13)14(26)27-23-5(24)1-2-6(23)25/h3H,1-2H2
charge 0 multiplicity 1
33 atoms
S  -0.297098 -1.473554 3.035245
F  -0.923379 0.446326 -1.327468
F  -3.023425 -1.270554 2.728078
F  -5.46313 -0.791537 1.645922
F  -3.370518 0.912062 -2.373266
O  3.117012 0.108584 -0.224882
O  4.757969 -1.737801 -1.750804
O  4.660005 2.505908 0.303602
O  4.150948 -0.783663 1.713309
N  4.44234 0.356786 -0.679364
N  0.621176 -0.393092 0.754363
N  -5.798004 0.281894 -0.854268
N  -6.057851 0.774045 -1.999126
N  -6.555582 1.199369 -2.982001
C  6.498783 0.073583 -1.779976
C  6.468647 1.469939 -1.099761
C  5.164599 -0.601591 -1.444155
C  5.115077 1.576603 -0.389152
C  -1.851534 -0.43498 0.762663
C  -0.529565 -0.682987 1.337726
C  1.725551 -0.73948 1.529092
C  -2.013217 0.122144 -0.541442
C  -3.066324 -0.720667 1.444845
C  3.115168 -0.508507 1.087997
C  -4.334315 -0.480413 0.902054
C  -3.280624 0.36547 -1.091635
C  1.440939 -1.322467 2.76399
C  -4.483864 0.076356 -0.395567
H  7.317205 -0.566664 -1.410293
H  6.598562 0.131725 -2.877244
H  6.556612 2.301537 -1.819436
H  7.267484 1.599436 -0.350353
H  2.16355 -1.65771 3.50551
