program: Gaussian 09
title: 000131331
version: EM64L-G09RevD.01
frameworkgroup: C1[X(C19H26O4)]
method: RPBEPBE
basis: SDD
operation: Freq
keyword: #pfreq=noraman
keyword: PBEPBE/SDD
title: #p freq=noraman PBEPBE/SDD
converged: YES YES NO NO
title: Mulliken charges:
elementType: O O O O C C C C C C C C C C C C C C C C C C C H H H H H H H H H H H H H H H H H H H H H H H H H H
charge: -0.450697 -0.181214 -0.432126 -0.169288 -0.161177 -0.163171 -0.141865 0.306319 0.182929 -0.527696 -0.519038 -0.555645 -0.501478 0.516874 -0.003908 -0.137048 -0.548912 -0.793860 -0.467770 -0.681944 -0.441632 -0.210829 -0.069594 0.292396 0.232777 0.220686 0.229538 0.220369 0.220364 0.225955 0.256935 0.225183 0.227247 0.219569 0.226886 0.225842 0.217903 0.248854 0.230219 0.235205 0.216919 0.242397 0.219513 0.188541 0.232484 0.178225 0.236443 0.358155 0.324164
chargesum: 0.00000
title: Mulliken charges with hydrogens summed into heavy atoms:
elementType: O O O O C C C C C C C C C C C C C C C C C C C
charge: -0.092542 -0.181214 -0.107962 -0.169288 0.131220 0.069606 0.078822 0.306319 0.182929 -0.077789 -0.072719 -0.073528 -0.054662 0.516874 -0.003908 0.089838 -0.105167 -0.079583 -0.250851 -0.220034 -0.020607 -0.032604 0.166849
polarizability: 2.50622074e+02 -6.89439348e+00 1.92887013e+02 5.29628794e+00 4.13872261e+00 1.64641752e+02
1716.lowfreq: -0.0009 -0.0001 0.0005 9.1434 11.2832 20.4861 34.6796 41.7623 51.3426
frequency: 34.3283 41.7131 51.3320 65.9689 90.4733 99.1425 133.4959 151.6513 159.6528 195.6796 208.2722 211.8969 234.1272 247.5641 258.8007 265.7749 282.0153 288.1771 299.9286 300.4175 344.5844 353.3179 362.7549 380.0934 392.6160 411.5099 415.4434 438.1358 445.4725 472.0725 482.5287 489.8819 513.3751 539.0612 579.4821 588.5034 607.3801 644.2600 677.5306 711.9671 731.9699 777.5395 796.3196 811.2591 820.3843 832.1372 856.1133 870.3776 891.6978 898.2436 912.5333 929.2432 945.2357 954.7713 968.1935 987.8281 993.0637 999.0219 1006.8810 1009.0524 1021.3716 1031.2080 1055.5618 1062.5723 1076.3596 1099.2320 1101.6185 1109.5108 1121.8040 1125.4616 1136.3789 1146.7444 1159.8203 1165.2000 1173.9448 1180.5533 1183.5425 1196.0263 1211.4047 1238.4116 1248.1085 1254.1752 1259.5019 1268.5739 1275.5126 1291.3128 1294.8903 1302.9533 1306.2150 1322.4874 1325.2527 1330.4953 1334.5367 1341.4171 1343.6969 1346.1807 1347.2751 1352.9564 1357.9051 1377.4062 1378.1199 1391.9478 1398.9807 1455.8881 1457.0502 1457.9031 1464.1521 1468.5006 1471.4314 1474.5153 1483.8311 1494.4893 1627.4315 1650.3694 1692.7596 2839.1363 2918.7760 2932.4319 2934.8504 2936.0560 2952.0090 2955.4150 2977.3421 2982.7150 2983.5794 2989.2558 2991.5105 3009.8834 3017.9884 3032.2510 3033.9678 3038.8087 3048.6984 3049.0994 3059.3200 3079.9016 3087.6415 3093.2345 3095.3044 3505.3901 3540.2424
redmass: 6.2573 7.5107 4.3792 6.9000 5.0424 4.8735 3.2867 2.7877 3.4984 2.1742 3.3276 1.9637 3.5388 3.3332 2.5865 2.7553 2.1744 2.3573 1.5575 2.7146 2.2032 3.2067 2.3275 2.7340 3.0681 2.0373 2.0324 2.1826 2.8338 3.5137 2.5934 3.3391 3.5222 3.6899 4.3574 2.9325 4.0508 3.4404 3.0041 3.4469 3.1419 4.1635 2.0868 2.1295 2.0985 1.8360 2.0638 2.4393 1.7345 2.7439 2.0719 1.9498 2.3087 1.9742 2.2037 2.2881 2.6161 2.1379 2.4414 2.2435 1.9216 1.9414 2.8358 2.1747 2.8512 2.3359 2.2466 2.6581 2.6737 2.3966 1.8751 1.4910 1.5116 1.6632 1.7279 1.5612 1.4396 1.6671 1.6219 1.3220 1.6937 1.6658 1.4754 1.4348 1.3906 1.3722 1.5203 1.3604 1.4440 1.2858 1.3309 1.4692 1.3703 1.4393 1.5245 1.5986 1.5109 1.4295 1.3962 1.2797 1.4402 1.1841 1.2290 1.0818 1.0874 1.0882 1.0801 1.0860 1.0916 1.0842 1.0650 1.0600 9.0517 12.1782 7.9218 1.0836 1.0815 1.0811 1.0676 1.0677 1.0675 1.0830 1.0601 1.0599 1.0624 1.0716 1.0481 1.0898 1.0655 1.0993 1.0860 1.0979 1.0939 1.1020 1.0953 1.0993 1.1011 1.0988 1.0907 1.0653 1.0658
irintensity: 3.5746 2.4104 0.3687 8.6922 0.2738 0.5697 0.1572 1.1907 6.2075 1.9878 2.0397 1.4523 18.8506 2.4624 4.1732 2.2140 12.4310 6.1678 33.5523 4.4727 71.3427 11.6927 18.0605 32.6855 0.7314 66.8438 52.8815 1.8194 8.7677 2.0276 1.2319 3.0346 3.4283 1.3767 2.3175 0.9309 4.9144 4.8807 3.9791 4.1190 2.5638 1.9919 3.6291 24.9259 2.8195 11.6488 20.2339 5.8629 13.0841 5.8005 15.6209 12.1731 1.1077 39.1708 11.0011 5.0397 78.2597 30.1809 28.4918 71.4326 15.5711 14.7108 0.3469 1.6077 2.7493 4.8005 4.6020 11.8961 6.2122 2.1450 3.5323 6.5420 41.2093 3.9056 3.5998 5.5539 19.1955 8.4897 12.4870 4.0085 5.5283 2.7570 16.3035 26.1993 9.0983 1.6834 3.6306 2.6204 4.6124 1.0561 0.4300 2.0796 1.0868 4.9488 9.0760 1.5658 9.1071 3.2603 2.4580 23.8167 19.6633 21.4646 2.6771 6.7112 9.3024 11.0499 6.0570 20.7160 12.0481 0.7458 7.4305 8.4455 97.2097 170.3202 2.3715 99.9700 9.8465 10.4585 20.1869 38.8175 33.2344 39.0394 34.0604 10.2885 22.0098 4.1744 30.3154 14.2750 40.5518 17.4145 14.3286 57.0618 33.1830 32.9739 41.3120 25.8375 11.6757 24.4856 33.9039 8.0494 8.4098
temp: 298.150 k
press: 1.00000 atm
elementType: 8 8 8 8 6 6 6 6 6 6 6 6 6 6 6 6 6 6 6 6 6 6 6 1 1 1 1 1 1 1 1 1 1 1 1 1 1 1 1 1 1 1 1 1 1 1 1 1 1
symmnumber: 1
zpe: 1087357.7 jmol-1
zpe.correction: 0.414153 hartree
zpe.thermalcorrener: 0.435805 hartree
zpe.thermalcorrenthalpy: 0.436749 hartree
zpe.thermalcorrgfe: 0.364896 hartree
zpe.sumelectzpe: -1038.719158 hartree
zpe.sumelectthermal: -1038.697505 hartree
zpe.sumelectthermalent: -1038.696561 hartree
zpe.sumelectthermalfe: -1038.768414 hartree
dipole: 0.4800 -1.3683 0.3880
dipole: 1.5011
quadrupole: -162.3950 -137.5760 -144.2488
quadrupole: -7.7090 -4.7442 1.6078
quadrupole: -14.3217 10.4973 3.8245 -7.7090 -4.7442 1.6078
hfenergy: -1039.1333103 hartree
pointgroup: C01 [X(C19H26O4)]
dipole: -0.1789115 0.5428821 0.1484773 debye
polarizability: 250.3126631|-7.9388167|193.0562587|-5.7575966|-4.2765056|164.7819171 unknown
InChI: InChI=1S/C19H26O4/c1-18-6-5-14-13(15(18)9-16(22)17(18)23)3-2-11-8-12(21)4-7-19(11,14)10-20/h2,10,12-16,21-22H,3-9H2,1H3
charge 0 multiplicity 1
49 atoms
O  4.947834 -1.732257 -1.005265
O  4.863754 1.162708 -0.945678
O  -6.141601 -0.355754 -0.50201
O  -1.792772 0.716771 2.455319
C  0.494616 -0.683537 0.321436
C  1.972169 -0.623886 -0.10679
C  -0.300902 0.409598 -0.460972
C  2.618827 0.783014 0.10856
C  -1.825338 0.438774 -0.019684
C  0.367517 1.818742 -0.395437
C  1.875254 1.813765 -0.761742
C  2.996163 -1.624245 0.500063
C  -0.104328 -2.079699 0.036741
C  -2.393475 -0.978712 0.141719
C  4.057648 0.457281 -0.291184
C  4.370792 -1.011069 0.137477
C  -2.665661 1.217184 -1.084856
C  2.671132 1.225676 1.606536
C  -1.612618 -2.090124 0.130165
C  -3.900919 -1.071802 0.336105
C  -4.186579 1.168527 -0.811504
C  -1.914619 1.214951 1.312595
C  -4.688334 -0.285613 -0.737337
H  0.399973 -0.487493 1.408725
H  1.98842 -0.797585 -1.208202
H  -0.305454 0.092962 -1.529005
H  0.256738 2.241775 0.62186
H  -0.159551 2.51199 -1.077554
H  2.005592 1.549032 -1.829992
H  2.299636 2.826709 -0.630427
H  2.917336 -2.635251 0.068106
H  2.87642 -1.710283 1.595253
H  0.31108 -2.818112 0.750896
H  0.215325 -2.427028 -0.971262
H  5.087726 -1.012683 0.98586
H  -2.459306 0.775252 -2.079871
H  -2.334773 2.272896 -1.129909
H  1.659545 1.340658 2.029491
H  3.21099 0.500604 2.240987
H  3.189666 2.198019 1.68759
H  -2.098653 -3.07277 0.217811
H  -4.226422 -2.127118 0.333764
H  -4.168503 -0.651306 1.331847
H  -4.417539 1.678515 0.149461
H  -4.736931 1.709861 -1.602673
H  -2.079025 2.320199 1.195938
H  -4.567817 -0.771386 -1.722552
H  5.628406 -1.137545 -1.421735
H  -6.331442 0.011994 0.399637
