program: Gaussian 09
title: 000131307
version: EM64L-G09RevD.01
frameworkgroup: C1[X(C21H24ClNO2)]
method: RPBEPBE
basis: SDD
operation: Freq
keyword: #p
keyword: freq=noraman
keyword: PBEPBE/SDD
title: #p freq=noraman PBEPBE/SDD
converged: YES YES NO NO
title: Mulliken charges:
elementType: Cl O O N C C C C C C C C C C C C C C C C C C C C C H H H H H H H H H H H H H H H H H H H H H H H H
charge: -0.082764 -0.273752 -0.246598 -0.083660 0.030345 -0.421153 -0.444568 -0.404365 -0.393463 -0.284243 -0.534751 -0.584123 0.254422 0.465048 0.488147 -0.415717 -0.352342 -0.391675 -0.429925 -0.229105 -0.227279 -0.242078 -0.227522 -0.243024 -0.243306 0.235391 0.218152 0.231659 0.212184 0.222613 0.188019 0.223602 0.217666 0.192187 0.218330 0.227331 0.242689 0.263333 0.272684 0.228653 0.251308 0.281342 0.231038 0.225252 0.225480 0.225793 0.225644 0.228576 0.228528
chargesum: 0.00000
title: Mulliken charges with hydrogens summed into heavy atoms:
elementType: Cl O O N C C C C C C C C C C C C C C C C C C C C C
charge: -0.082764 -0.273752 -0.246598 -0.083660 0.265736 0.028658 -0.009770 0.007256 0.016390 0.161419 -0.292062 -0.048107 0.254422 0.465048 0.488147 -0.187065 -0.101034 -0.110332 -0.198887 -0.003854 -0.001799 -0.016285 -0.001878 -0.014448 -0.014779
polarizability: 2.84368794e+02 -3.13809383e+00 2.46940603e+02 6.78781563e+00 -1.30484093e+01 2.03491105e+02
1716.lowfreq: -1.5388 0.0008 0.0013 0.0016 2.0403 3.8118 7.9777 13.7447 22.8721
frequency: 6.5571 13.7205 22.7951 31.0586 38.7862 43.3620 55.4243 71.6612 75.1050 89.1703 114.4405 140.5696 160.0531 192.1579 210.7550 228.8116 239.0909 258.0164 276.1265 280.1212 313.6828 320.6145 359.1099 376.0883 402.1555 404.8034 438.6947 452.0706 476.2639 479.7864 511.5491 547.5199 591.7812 614.9755 615.4677 640.1967 659.9504 694.5300 703.8579 708.7245 721.9840 754.2251 758.4322 776.8781 778.9352 817.9421 819.1270 847.1235 851.5149 858.0882 859.8144 891.8946 922.5460 929.5351 933.1114 958.3028 972.1839 978.4811 984.3436 990.0696 991.1236 994.0076 1000.8501 1002.5623 1017.2884 1026.7728 1028.8613 1030.3954 1068.4972 1079.4889 1089.1456 1097.6369 1099.4141 1110.5592 1130.6903 1145.6345 1149.8602 1171.7645 1172.7466 1178.8864 1188.9899 1194.5561 1195.4978 1208.8392 1244.3963 1249.1731 1256.7896 1261.9266 1276.9842 1293.0949 1297.6218 1309.3365 1311.0894 1334.7595 1336.5622 1341.7750 1348.0064 1357.3516 1366.8155 1381.7565 1385.8946 1388.6605 1440.5676 1442.7172 1452.6974 1453.5196 1466.0582 1467.6290 1476.6458 1479.3312 1482.1697 1482.4339 1591.2861 1594.4654 1607.3260 1612.2931 1629.0291 2841.2805 2851.1794 2925.8203 3007.2453 3008.4006 3014.1427 3039.1252 3044.0726 3046.5572 3053.7327 3066.4113 3075.0163 3081.4599 3116.9914 3117.5642 3126.3202 3127.8119 3139.4665 3140.5457 3151.5594 3153.8831 3154.3259 3163.8035 3166.4652
redmass: 5.4002 4.3844 5.3296 4.0934 4.0593 5.7284 4.8175 4.3891 5.4640 2.6387 4.9914 5.8422 6.2349 4.7212 4.6171 1.9258 4.2074 5.0911 3.3813 4.3151 5.1274 5.0491 2.5650 3.0338 2.7906 2.8756 5.1619 2.3511 3.1288 3.4238 3.6841 6.2698 2.9551 6.3803 6.3589 4.4694 5.5532 4.1460 2.0023 1.8778 4.5235 1.9696 2.7017 2.0137 1.4310 1.4763 3.2109 1.2664 2.6207 2.2942 1.6668 3.2216 1.8435 1.7258 1.5422 3.5480 1.3953 1.4716 1.3854 5.7050 5.8220 1.3441 2.6183 1.3562 1.3926 2.2567 2.4966 2.2537 3.4559 1.6522 1.6015 2.9164 2.2011 2.4341 1.5623 1.9524 1.4804 1.1025 1.0800 2.5558 1.1556 1.9587 1.2212 1.5135 1.2496 1.4863 1.3403 1.3256 1.3752 1.3092 1.5542 1.3140 1.3199 1.2795 1.2820 1.3263 1.5355 1.4873 1.4566 6.9977 6.4344 1.3937 2.2005 2.1081 1.0918 1.0955 1.0955 1.0801 1.0850 2.2184 1.2873 1.7077 6.1203 6.0736 6.0282 5.9714 9.1742 1.0717 1.0706 1.0692 1.0719 1.0613 1.0723 1.0869 1.0887 1.0843 1.0910 1.0579 1.1036 1.1038 1.0866 1.0864 1.0870 1.0870 1.0925 1.0925 1.0952 1.1117 1.0955 1.1013 1.1004
irintensity: 0.0224 0.0072 0.2809 1.1250 0.1092 1.1615 0.3318 1.7772 0.8353 1.2898 1.8192 2.1849 0.8431 0.7154 1.0932 2.0254 3.6632 9.1688 7.3149 0.3458 3.2477 3.4442 10.9000 5.2254 0.1712 0.1635 0.8708 2.5320 1.7409 3.4035 8.0641 12.7438 14.0226 0.7444 0.1351 13.1857 107.6103 5.9514 49.4559 48.1682 23.3938 40.0815 8.2796 18.8790 15.3642 0.6169 8.0546 0.0281 1.2301 0.4593 0.1446 1.5719 12.7021 11.1697 5.6790 51.1398 0.2040 3.8434 0.1049 0.6344 3.1589 0.0466 141.0797 6.0763 0.8582 11.9165 49.2894 8.3297 1.4715 10.1915 21.6866 472.2442 20.8025 23.5046 13.1419 44.5193 1.5013 0.9084 1.0177 4.9559 1.9047 3.3503 2.4169 0.9287 18.5912 13.5136 11.1332 2.3357 6.6965 22.5529 91.8251 1.1017 11.3571 21.8066 8.0380 30.9537 2.3959 3.1246 1.3246 2.0174 0.0521 6.4845 18.5174 0.7778 8.6349 4.9076 11.5028 1.2397 4.9978 35.2462 30.0635 6.9487 5.3752 1.5085 13.8931 8.2074 104.2758 55.1898 118.5990 63.7622 0.5726 14.3775 27.2260 38.5425 19.6344 5.9036 21.8652 22.7645 15.1125 35.8445 6.3111 5.5995 1.8183 0.7825 23.4089 27.9844 14.5172 15.3760 31.8212 29.0313 15.9234
temp: 298.150 k
press: 1.00000 atm
elementType: 17 8 8 7 6 6 6 6 6 6 6 6 6 6 6 6 6 6 6 6 6 6 6 6 6 1 1 1 1 1 1 1 1 1 1 1 1 1 1 1 1 1 1 1 1 1 1 1 1
symmnumber: 1
zpe: 1056730.5 jmol-1
zpe.correction: 0.402487 hartree
zpe.thermalcorrener: 0.426035 hartree
zpe.thermalcorrenthalpy: 0.426980 hartree
zpe.thermalcorrgfe: 0.343372 hartree
zpe.sumelectzpe: -1478.054433 hartree
zpe.sumelectthermal: -1478.030885 hartree
zpe.sumelectthermalent: -1478.029941 hartree
zpe.sumelectthermalfe: -1478.113549 hartree
dipole: -1.7356 -0.4417 0.7026
dipole: 1.9238
quadrupole: -182.5707 -143.8552 -149.8638
quadrupole: -1.9382 -4.1421 -3.4694
quadrupole: -23.8074 14.9080 8.8994 -1.9382 -4.1421 -3.4694
hfenergy: -1478.4569204 hartree
pointgroup: C01 [X(C21H24Cl1N1O2)]
dipole: 0.7089946 -0.0293688 0.2633487 debye
polarizability: 282.1640123|-5.4540506|233.9863957|-9.3399788|25.4782038|218.6500933 unknown
InChI: InChI=1S/C21H24ClNO2/c22-13-16-23-14-11-19(12-15-23)25-21(24)20(17-7-3-1-4-8-17)18-9-5-2-6-10-18/h1-10,19-20H,11-16H2
charge 0 multiplicity 1
49 atoms
Cl -8.790168 0.921385 1.003212
O  -0.537658 0.14203 0.532932
O  0.427057 0.408479 -1.573307
N  -4.750111 0.569591 0.144782
C  -1.844149 0.662682 0.004145
C  -2.637895 -0.484838 -0.642504
C  -2.596696 1.258304 1.198794
C  -4.046221 0.011379 -1.035822
C  -4.006024 1.701519 0.749915
C  -6.186949 0.857243 -0.069721
C  1.773652 -0.47675 0.329513
C  -6.959542 0.46286 1.19688
C  0.520302 0.059945 -0.372792
C  2.308446 -1.767436 -0.312906
C  2.829221 0.645834 0.403786
C  2.915907 -2.730247 0.533972
C  3.579433 1.034251 -0.733813
C  2.255003 -2.02142 -1.707207
C  3.041309 1.318861 1.63239
C  3.462717 -3.919023 0.004022
C  4.528334 2.075583 -0.639515
C  2.798249 -3.214134 -2.236944
C  3.992857 2.359752 1.728294
C  3.405572 -4.166085 -1.387281
C  4.740133 2.741123 0.590934
H  -1.613099 1.436134 -0.754328
H  -2.734856 -1.310283 0.086372
H  -2.108152 -0.860339 -1.535862
H  -2.041194 2.120718 1.610154
H  -2.686806 0.493862 1.991713
H  -3.95638 0.769232 -1.856899
H  -4.636096 -0.834273 -1.432137
H  -4.568529 2.076981 1.623404
H  -3.916035 2.553764 0.026364
H  -6.381093 1.926414 -0.314653
H  -6.561636 0.258562 -0.919048
H  1.466015 -0.71094 1.362924
H  -6.615516 1.004984 2.090121
H  -6.933937 -0.621845 1.369766
H  2.965563 -2.544061 1.614062
H  3.422079 0.522691 -1.688595
H  1.77813 -1.293435 -2.371717
H  2.459475 1.028221 2.515986
H  3.928195 -4.650797 0.673951
H  5.104048 2.367476 -1.525127
H  2.746159 -3.398482 -3.316092
H  4.150291 2.868913 2.685847
H  3.826406 -5.089077 -1.801692
H  5.479486 3.546795 0.661927
