program: Gaussian 09
title: 000131304
version: EM64L-G09RevD.01
frameworkgroup: C1[X(C12H25N2O6S)]
method: RPBEPBE
basis: SDD
operation: Freq
keyword: #p
keyword: freq=noraman
keyword: PBEPBE/SDD
title: #p freq=noraman PBEPBE/SDD
converged: YES YES NO NO
title: Mulliken charges:
elementType: S O O O O O O N N C C C C C C C C C C C C H H H H H H H H H H H H H H H H H H H H H H H H H
charge: 1.061336 -0.267622 -0.255960 -0.267293 -0.549337 -0.597845 -0.496648 -0.125944 -0.382683 -0.391447 -0.011364 -0.574902 -0.560388 -0.570750 -0.567443 0.279798 0.305467 -0.378562 -0.562669 -0.489332 -0.650730 0.311357 0.306551 0.247571 0.314952 0.254282 0.257224 0.260597 0.309537 0.251472 0.299690 0.260336 0.256014 0.236002 0.286830 0.347725 0.294391 0.275256 0.334375 0.334176 0.257630 0.256998 0.218003 0.243225 0.239260 0.400859
chargesum: 1.00000
title: Mulliken charges with hydrogens summed into heavy atoms:
elementType: S O O O O O O N N C C C C C C C C C C C C
charge: 1.061336 -0.267622 -0.255960 -0.267293 -0.148477 -0.597845 -0.496648 -0.125944 -0.034958 0.226461 0.236207 0.251557 0.261218 0.245290 -0.044611 0.279798 0.305467 0.191085 0.105882 0.025297 0.049759
polarizability: 2.33573645e+02 1.16934202e+00 1.79175073e+02 -7.89940030e-01 1.95699155e+00 1.54360302e+02
1716.lowfreq: -15.0338 -8.7561 -0.0011 0.0007 0.0009 1.9206 8.5970 20.5425 29.7965
frequency: -13.5409 20.3166 29.5547 41.9528 44.1137 53.0542 66.3843 75.3275 84.0573 107.0574 118.1682 127.9213 155.6461 169.1264 193.2524 196.5483 199.6023 206.6734 213.3680 234.6724 243.2311 272.5554 275.1792 285.6521 288.2029 297.6863 304.2832 307.9060 324.9453 339.8721 357.5005 390.6859 429.2399 442.8653 456.8578 474.3800 490.3118 514.9890 533.7566 549.5460 557.9253 587.8547 616.9060 649.9206 694.5676 747.7222 786.1037 806.2216 816.5103 837.2571 848.5755 874.7537 888.1353 900.8625 924.7293 932.9520 938.5217 952.2364 989.5255 1011.0012 1020.3917 1037.9778 1054.6663 1056.7668 1065.4066 1082.2973 1083.5577 1101.4620 1110.8446 1116.1460 1137.2777 1155.1337 1199.9118 1219.1794 1221.8136 1230.4725 1240.7661 1243.3869 1258.4770 1282.7906 1287.6341 1299.3453 1332.9144 1348.5624 1367.9160 1372.3383 1403.5072 1407.6309 1414.3436 1423.6358 1427.6894 1430.3218 1439.2316 1439.9051 1445.6625 1457.8093 1466.2970 1473.2501 1476.1972 1478.0978 1482.3105 1488.0338 1492.7233 1496.3987 1507.4626 1612.2647 1640.8484 2989.2206 2997.9694 3005.0593 3008.8439 3010.0832 3011.9447 3013.8054 3019.3870 3025.6404 3057.0735 3065.8089 3066.1922 3101.9344 3107.6433 3110.3390 3112.6261 3125.9736 3131.6794 3134.8306 3136.7056 3141.7596 3145.2968 3167.1077 3484.5434 3551.2808
redmass: 2.2085 4.6096 4.1530 4.5924 5.8902 4.4484 4.3075 4.1945 6.8981 3.0461 5.8219 4.3515 6.0418 2.7992 2.6187 1.5602 1.9675 1.3611 3.4127 3.6485 2.6062 1.3986 2.0270 1.3102 1.7807 3.4452 2.7960 3.1687 4.4364 6.0178 2.4214 2.5843 2.2236 3.0416 3.9094 2.5697 3.6442 2.7857 2.9966 2.9384 2.6137 2.8440 2.9294 3.9555 4.6534 4.2430 1.4368 2.8044 3.9962 4.2053 3.8255 3.2617 2.6392 3.0330 3.0479 4.8715 2.9543 2.5822 2.3373 2.1218 2.2669 1.8780 1.2612 1.2050 2.3156 1.9732 2.3813 1.7375 1.7308 1.7389 1.9237 1.3476 1.3378 1.4477 1.6134 1.2847 1.2024 1.5780 1.8154 1.4040 1.1604 1.4595 1.4844 1.5294 1.2638 1.4808 1.1977 1.0945 1.1496 1.1275 1.1196 1.1105 1.1185 1.0980 1.1082 1.0580 1.1226 1.0654 1.0426 1.0462 1.0501 1.0545 1.6022 1.1579 1.0588 5.8568 8.8173 1.0660 1.0677 1.0364 1.0389 1.0653 1.0671 1.0333 1.0371 1.0614 1.0936 1.0572 1.0985 1.1004 1.0981 1.1044 1.1006 1.1060 1.1062 1.1056 1.1056 1.1050 1.1048 1.1120 1.0666 1.0792
irintensity: 0.4253 1.4835 0.5338 2.2458 0.6418 3.3457 6.6360 0.6993 7.7554 11.5128 11.9529 6.2294 0.9632 5.9716 26.9302 1.6178 4.2152 1.6941 4.7089 2.1107 16.2605 7.2334 49.7408 3.1432 3.9446 25.3870 22.7349 51.2179 26.9776 21.5485 5.4111 1.5149 2.1993 1.4843 5.4074 4.8080 15.4453 74.0132 33.1879 68.4794 94.7158 46.4223 3.7528 3.7205 1.7735 3.0009 15.1044 2.8166 53.4987 28.5581 48.8173 3.1738 8.1157 45.0960 91.3795 41.9484 11.1778 42.5999 11.2259 61.2743 132.7613 6.8262 101.2446 1.1624 113.9142 4.5018 3.2342 8.8599 120.2613 88.5130 8.5381 7.3594 2.6792 42.0325 4.5467 6.2745 3.8353 12.8761 0.4757 3.9389 17.0249 2.2051 21.5154 26.8111 26.0380 16.2750 19.4564 27.2308 21.5976 2.2668 27.6196 24.2258 22.6001 21.9803 1.3493 3.3666 14.1135 3.5992 11.9123 11.5615 14.0311 37.8188 222.3229 22.8603 74.2519 108.1839 131.6160 11.4007 2.6488 20.5390 10.2084 7.3958 14.2424 11.2217 12.0025 45.0674 2.2580 3.5438 5.4396 26.0328 2.3623 10.0743 16.3423 9.6616 0.0478 3.8283 3.1839 5.9442 7.9890 4.2733 95.7902 43.6018
temp: 298.150 k
press: 1.00000 atm
elementType: 16 8 8 8 8 8 8 7 7 6 6 6 6 6 6 6 6 6 6 6 6 1 1 1 1 1 1 1 1 1 1 1 1 1 1 1 1 1 1 1 1 1 1 1 1 1
symmnumber: 1
zpe: 991898.8 jmol-1
zpe.correction: 0.377794 hartree
zpe.thermalcorrener: 0.403035 hartree
zpe.thermalcorrenthalpy: 0.403979 hartree
zpe.thermalcorrgfe: 0.321897 hartree
zpe.sumelectzpe: -1429.091173 hartree
zpe.sumelectthermal: -1429.065932 hartree
zpe.sumelectthermalent: -1429.064988 hartree
zpe.sumelectthermalfe: -1429.147070 hartree
dipole: 0.1422 3.9094 -0.2981
dipole: 3.9233
quadrupole: -89.9567 -90.9346 -130.4180
quadrupole: 6.7417 -1.3709 -5.9636
quadrupole: 13.8131 12.8351 -26.6483 6.7417 -1.3709 -5.9636
hfenergy: -1429.4689669 hartree
pointgroup: C01 [X(C12H25N2O6S1)]
dipole: 1.1409244 1.0028985 0.2738798 debye
polarizability: 206.0181451|-28.2554009|203.5958622|0.9767766|10.0256121|157.4950122 unknown
InChI: InChI=1S/C12H25N2O6S/c1-5-12(16)20-10(9-14(2,3)4)8-11(15)13-6-7-21(17,18)19/h10,13,17H,5-9H2,1-4H3
charge 1 multiplicity 1
46 atoms
S  -2.173384 2.986603 0.363447
O  1.32634 -2.103443 -0.749989
O  -1.182708 -0.290255 -1.664198
O  3.02633 -2.822789 0.682233
O  -2.557559 4.685433 -0.215475
O  -0.554913 2.771712 0.375879
O  -2.969415 2.636729 1.725147
N  2.50117 1.05614 0.28641
N  -2.676647 -0.018208 0.084137
C  1.285597 0.332497 -0.349082
C  0.93375 -1.053194 0.236318
C  3.79424 0.262593 0.125315
C  2.632153 2.400628 -0.436105
C  2.234492 1.33632 1.764677
C  -0.574859 -1.223761 0.541628
C  -1.494251 -0.499379 -0.45096
C  2.363739 -2.993011 -0.367685
C  -3.602775 0.805281 -0.709074
C  -2.970091 2.122078 -1.180193
C  2.510544 -4.106621 -1.379619
C  3.885711 -4.799466 -1.320988
H  0.45696 1.048653 -0.224914
H  1.489487 0.225648 -1.426576
H  1.496541 -1.268922 1.16541
H  3.706118 -0.707718 0.63821
H  4.621339 0.846631 0.558648
H  3.975944 0.098981 -0.948369
H  2.814018 2.21332 -1.505335
H  1.69365 2.961661 -0.302789
H  3.478902 2.955423 -0.003498
H  1.285347 1.889417 1.847055
H  2.18348 0.387034 2.317445
H  3.063429 1.940752 2.164216
H  -0.773019 -0.861407 1.568454
H  -0.804583 -2.305024 0.528952
H  -2.901794 -0.171148 1.069386
H  -3.905614 0.266244 -1.627594
H  -4.501985 0.993095 -0.102149
H  -2.114464 1.976464 -1.855778
H  -3.695987 2.856839 -1.559402
H  1.704588 -4.839659 -1.169829
H  2.287669 -3.702604 -2.383275
H  4.699343 -4.105879 -1.595775
H  4.095225 -5.181522 -0.308207
H  3.909151 -5.648166 -2.024891
H  -2.31591 5.349997 0.493481
