program: Gaussian 09
title: 000131299
version: EM64L-G09RevD.01
frameworkgroup: C1[X(C13H17N3O6S2)]
method: RPBEPBE
basis: SDD
operation: Freq
keyword: #p
keyword: freq=noraman
keyword: PBEPBE/SDD
title: #p freq=noraman PBEPBE/SDD
converged: YES YES NO NO
title: Mulliken charges:
elementType: S S O O O O O O N N N C C C C C C C C C C C C C H H H H H H H H H H H H H H H H H
charge: 0.081892 0.101385 -0.325678 -0.314670 -0.405208 -0.226998 -0.164325 -0.183920 -0.383926 0.100021 0.010414 0.337443 -0.713464 -0.705015 -0.711966 -0.129812 0.349974 -0.723495 0.187764 -0.434025 0.430930 -0.222342 -0.149950 -0.329136 0.241513 0.265509 0.200716 0.231545 0.225030 0.202548 0.267778 0.218486 0.207921 0.298004 0.339300 0.305693 0.334209 0.388047 0.283831 0.251823 0.262154
chargesum: 0.00000
title: Mulliken charges with hydrogens summed into heavy atoms:
elementType: S S O O O O O O N N N C C C C C C C C C C C C C
charge: 0.081892 0.101385 -0.325678 -0.314670 -0.017161 -0.226998 -0.164325 -0.183920 -0.044625 0.100021 0.010414 0.337443 -0.005727 -0.045892 -0.017781 0.168192 0.349974 -0.083593 0.187764 -0.434025 0.430930 0.061489 0.101873 -0.066981
polarizability: 2.68062406e+02 1.11552708e+01 2.59327417e+02 -2.13394121e+00 6.44793610e-01 1.59280395e+02
1716.lowfreq: -8.0266 -3.4904 0.0011 0.0012 0.0017 5.7994 14.1236 19.1448 24.0820
frequency: 12.3625 18.6355 24.0136 32.4598 41.5519 47.3478 56.0576 59.0805 63.4308 77.4966 93.6634 97.8249 122.9086 139.8165 162.2348 175.6541 179.7656 204.5135 232.3773 236.4054 241.5657 246.5318 284.7263 291.2978 306.4938 329.7241 337.1910 343.4342 382.2967 404.9040 410.2409 424.3282 432.9085 438.7260 464.2915 491.2373 510.6788 542.8881 548.4533 564.8814 594.7760 617.4900 643.1586 675.3282 691.4835 700.0835 702.3262 708.7994 739.6756 756.8204 792.0492 805.4042 821.1721 826.5890 914.5575 914.8025 922.4776 942.6521 955.0210 980.9913 985.9060 994.0806 1007.6751 1029.7131 1034.9449 1039.9384 1084.5081 1117.5565 1139.8608 1148.9381 1163.7699 1211.1793 1215.9038 1219.9246 1232.5843 1240.4707 1256.5216 1271.1657 1288.8798 1311.1231 1322.3598 1326.2086 1371.2028 1374.8724 1380.1103 1389.9430 1399.1071 1401.4323 1409.4762 1444.9771 1466.9721 1467.3437 1469.2497 1477.3813 1479.3702 1501.2948 1531.8443 1555.1919 1630.5394 1657.9591 2977.0202 2988.3670 2990.1227 2995.2908 3030.2123 3080.6532 3085.3316 3094.9919 3098.3630 3112.5349 3118.5077 3128.3610 3151.5825 3167.0085 3185.7351 3515.3356 3589.4921
redmass: 4.9376 5.9944 7.2480 6.3680 6.8194 7.5411 6.8079 10.2451 8.6894 5.6444 7.0160 5.6671 4.4654 9.3066 8.3907 1.1511 5.4248 6.9725 5.5961 1.0553 1.4309 1.8641 4.4757 6.9038 3.3300 2.6518 3.1738 11.4078 6.4872 2.7281 10.8994 9.7158 2.8694 3.0517 3.0574 4.3943 3.0283 3.3029 1.5038 5.5666 4.0522 8.5819 1.5845 8.4312 5.5915 9.2552 6.2276 7.6976 5.3308 3.1541 9.6277 3.2795 1.6269 2.6298 2.7562 1.6070 1.7149 1.3860 1.2045 3.1747 1.4249 5.8776 5.7761 1.4191 1.4335 3.5074 1.9947 1.9378 2.0672 2.2460 2.0223 1.5305 2.3679 1.8887 3.7467 1.4132 3.0179 2.7741 1.4799 10.8312 1.2644 2.4276 6.7424 1.2339 1.2437 2.3748 1.1172 1.2200 1.8919 1.0468 1.0741 1.0567 1.1170 1.6678 1.0881 1.0632 5.9232 6.1050 8.1191 9.2049 1.0803 1.0360 1.0358 1.0367 1.0602 1.0992 1.0988 1.0992 1.1003 1.0999 1.0996 1.1040 1.0894 1.0921 1.1007 1.0640 1.0776
irintensity: 2.1293 0.3172 1.9308 0.6285 0.8652 1.2580 4.1608 0.8909 3.9429 4.3014 3.1666 0.0072 1.9233 0.1795 2.5983 0.3033 0.5926 2.5433 7.7925 0.3551 0.2922 1.2417 4.8825 7.7998 11.3561 0.5060 16.7630 0.1697 5.1885 0.0918 2.6100 1.6219 4.0054 8.2391 10.9068 5.1840 3.8793 48.2065 163.1957 0.6717 44.4089 1.7192 117.7360 4.7487 11.2781 11.4316 45.6190 15.4022 15.9240 18.4307 30.1390 12.3135 37.5472 7.2289 52.2829 3.2588 6.4777 0.2383 0.2104 58.6675 1.1052 156.7603 8.0356 0.2633 5.9769 6.3582 157.2228 9.0522 5.4272 156.0634 275.4050 3.5870 27.7931 55.7599 139.4079 16.8050 25.9685 22.9002 60.1813 12.6524 40.2705 29.3372 116.3191 46.4218 31.4940 52.4675 18.6654 38.0273 54.5733 1.0088 26.0913 1.5545 62.7638 239.7102 32.3298 53.9432 27.3646 26.9959 214.8256 195.1168 30.0227 18.9243 14.0059 34.0012 3.7279 10.3100 9.3412 56.8808 34.8242 7.7775 12.2185 3.8919 8.1846 5.3843 10.1592 36.3416 35.7733
temp: 298.150 k
press: 1.00000 atm
elementType: 16 16 8 8 8 8 8 8 7 7 7 6 6 6 6 6 6 6 6 6 6 6 6 6 1 1 1 1 1 1 1 1 1 1 1 1 1 1 1 1 1
symmnumber: 1
zpe: 784394.1 jmol-1
zpe.correction: 0.298760 hartree
zpe.thermalcorrener: 0.325118 hartree
zpe.thermalcorrenthalpy: 0.326062 hartree
zpe.thermalcorrgfe: 0.237671 hartree
zpe.sumelectzpe: -1915.409719 hartree
zpe.sumelectthermal: -1915.383361 hartree
zpe.sumelectthermalent: -1915.382417 hartree
zpe.sumelectthermalfe: -1915.470808 hartree
dipole: -4.1508 -2.4187 0.6399
dipole: 4.8465
quadrupole: -123.4809 -156.7971 -157.8188
quadrupole: 12.7543 16.3129 6.3797
quadrupole: 22.5514 -10.7648 -11.7865 12.7543 16.3129 6.3797
hfenergy: -1915.7084794 hartree
pointgroup: C01 [X(C13H17N3O6S2)]
dipole: 1.6791622 -0.8783879 -0.2111139 debye
polarizability: 269.1725166|-10.7544204|257.8833478|-1.7786568|-5.7086288|159.6143529 unknown
InChI: InChI=1S/C13H17N3O6S2/c1-13(2,3)22-12(19)15-8(11(17)18)7-23-24-10-9(16(20)21)5-4-6-14-10/h4-6,8,15,17H,7H2,1-3H3
charge 0 multiplicity 1
41 atoms
S  1.192747 2.82037 -0.35974
S  1.515191 0.851748 -1.468148
O  -2.624907 -0.995199 -0.639622
O  -2.823039 -0.065029 1.539615
O  -2.501249 3.428103 -1.333467
O  -1.75213 4.695276 0.462625
O  0.69033 -0.98537 1.059803
O  1.469754 -2.955274 0.202244
N  -1.829804 1.082035 -0.240724
N  4.164992 0.795754 -0.72284
N  1.590019 -1.700047 0.479101
C  -3.269004 -2.331824 -0.28058
C  -2.43211 -3.033777 0.80643
C  -3.197113 -3.081563 -1.621813
C  -4.727048 -2.085342 0.15613
C  -1.512649 2.248362 0.563974
C  -2.461127 -0.011698 0.331275
C  -0.02773 2.329164 1.00792
C  -1.924555 3.57966 -0.07312
C  2.973969 0.168677 -0.56772
C  2.883802 -1.05498 0.151145
C  4.057017 -1.694727 0.610356
C  5.289211 -1.038464 0.426078
C  5.289814 0.227856 -0.208785
H  -1.38061 -3.135918 0.486525
H  -2.461491 -2.46945 1.75146
H  -2.843531 -4.045065 0.982493
H  -2.147981 -3.198067 -1.943384
H  -3.745761 -2.531199 -2.405645
H  -3.646205 -4.085238 -1.514717
H  -4.763619 -1.516103 1.098449
H  -5.275061 -1.527418 -0.624039
H  -5.234584 -3.055593 0.30835
H  -2.102868 2.142558 1.499115
H  -1.613539 1.060156 -1.2368
H  0.102741 3.1365 1.751051
H  0.292621 1.364964 1.42919
H  -2.729904 4.325241 -1.700307
H  3.986477 -2.664714 1.11135
H  6.22429 -1.484836 0.774946
H  6.213944 0.802671 -0.328075
