program: Gaussian 09
title: 000131262
version: EM64L-G09RevD.01
frameworkgroup: C1[X(C19H22N4O2)]
method: RPBEPBE
basis: SDD
operation: Freq
keyword: #p
keyword: freq=noraman
keyword: PBEPBE/SDD
title: #p freq=noraman PBEPBE/SDD
converged: YES YES NO NO
title: Mulliken charges:
elementType: O O N N N N C C C C C C C C C C C C C C C C C C C H H H H H H H H H H H H H H H H H H H H H H
charge: -0.249322 -0.274849 -0.093427 -0.083419 0.035396 -0.093591 -0.345215 -0.355766 -0.361134 -0.311757 -0.321491 -0.263205 0.280560 0.545103 -0.707391 0.113549 -0.324333 -0.597230 -0.398539 0.496676 -0.449487 -0.374139 -0.222041 -0.226696 -0.248972 0.196631 0.193227 0.236619 0.192211 0.184514 0.224921 0.194514 0.211663 0.212677 0.204489 0.205201 0.215352 0.225922 0.229399 0.247432 0.258901 0.245340 0.231806 0.241631 0.225111 0.225124 0.228035
chargesum: 0.00000
title: Mulliken charges with hydrogens summed into heavy atoms:
elementType: O O N N N N C C C C C C C C C C C C C C C C C C C
charge: -0.249322 -0.274849 -0.093427 -0.083419 0.035396 -0.093591 0.044643 0.073064 0.048302 0.094420 0.095675 0.157349 0.280560 0.545103 -0.252069 0.113549 -0.076902 -0.338329 -0.153200 0.496676 -0.217681 -0.132508 0.003070 -0.001572 -0.020937
polarizability: 3.55517822e+02 4.77020829e+01 2.07995516e+02 -1.78208741e+01 -1.59038261e+00 1.85572109e+02
1716.lowfreq: -4.4925 -2.9876 -1.0316 -0.0007 0.0003 0.0007 13.6265 18.3719 26.5054
frequency: 12.8026 16.5547 25.9680 31.6724 40.4236 46.9689 61.8384 77.8763 92.4170 132.5803 145.6262 152.8138 201.9527 216.5190 227.7277 232.2635 245.6444 274.3314 308.4160 322.5010 338.6456 349.1090 384.4354 400.5871 404.1827 430.7252 440.7447 456.4871 457.2600 473.4916 493.3556 495.9677 553.1057 566.8805 583.9729 617.3534 625.2922 653.0735 704.0699 719.1551 727.2183 732.1191 738.9690 762.9374 797.5533 804.8284 820.5922 842.8967 855.4752 877.7337 887.5012 901.5066 912.4646 920.6937 936.4045 942.4733 959.4825 977.5448 990.6206 995.4511 1009.5546 1021.2705 1026.1908 1028.1595 1051.9385 1063.8221 1071.5543 1081.6353 1092.0856 1103.7063 1145.1731 1150.3309 1160.1386 1171.1325 1184.6201 1187.6451 1191.0705 1197.0366 1215.6351 1216.7949 1232.9151 1247.8249 1270.6788 1274.4035 1292.3039 1294.9223 1297.1438 1331.1794 1332.1469 1338.9600 1343.4188 1356.6854 1366.2375 1371.1598 1381.7962 1386.5541 1392.5112 1421.0816 1439.8791 1443.9079 1444.7637 1451.0136 1453.5564 1461.8366 1465.0052 1467.6249 1483.6816 1496.9709 1575.4325 1593.1800 1611.8145 1615.2030 2061.9673 2851.2417 2858.7671 2873.6491 2955.5442 2959.1691 2966.4258 2971.9687 3016.2993 3018.2075 3020.8865 3042.6095 3049.3476 3079.4921 3087.5106 3113.8261 3119.3473 3132.5739 3137.0747 3143.3989 3147.1330 3161.6175 3162.4312
redmass: 5.2728 5.7423 4.9007 4.8489 5.1176 3.2881 7.7961 5.8667 4.8970 4.7697 6.2662 5.6470 3.2410 4.4749 5.5215 4.1252 1.8579 3.0442 4.2161 3.2912 2.8206 2.6312 2.3727 3.2141 2.8231 5.5405 8.7792 3.7399 3.5069 2.7449 3.6794 5.5990 4.7327 4.0788 1.9827 6.3800 4.7406 7.0485 2.1687 3.9027 2.3454 2.9119 4.2291 2.3922 2.1236 3.9413 1.9587 1.5966 1.2474 2.9861 1.4756 2.6368 2.3146 1.9358 1.6226 1.7376 1.9081 1.3901 6.1977 1.3208 3.1505 2.1941 2.2088 2.1514 2.3008 2.2781 3.2448 1.5859 3.1894 2.2558 2.1799 1.4875 2.0480 1.0601 1.2606 1.1520 1.0630 2.0045 1.8350 1.2585 3.8803 1.2925 1.2880 1.4953 1.6949 1.3658 1.3860 1.2930 1.7486 2.1659 1.2824 1.4450 1.4443 1.2974 6.8057 2.2976 2.2798 3.9262 2.0947 1.0818 1.0863 1.0917 1.0934 1.1619 1.1189 1.1341 2.2112 2.6092 7.3390 6.0797 6.4003 6.2816 13.9594 1.0704 1.0700 1.0696 1.0662 1.0564 1.0660 1.0599 1.0897 1.1003 1.1034 1.0907 1.0895 1.0970 1.0984 1.0869 1.0864 1.0912 1.0882 1.0960 1.0920 1.1015 1.0951
irintensity: 0.2447 0.2390 0.0432 0.1799 0.1150 0.4879 0.5042 1.5662 1.4479 0.9866 0.8229 0.4415 2.1542 1.7283 1.1832 1.5776 2.3447 11.5470 6.9320 1.1833 4.1861 1.7808 0.6025 4.1819 0.6230 0.3025 0.8927 3.1999 8.4925 1.2811 0.4112 0.8709 3.9089 40.7686 6.7664 1.7147 8.1936 9.9919 38.1089 6.7776 30.7510 10.4569 2.3076 33.7014 30.1284 14.0334 11.9994 0.0402 0.0516 25.2459 19.0845 5.3122 22.6168 7.7076 13.2124 26.6721 8.6182 0.1292 0.4002 0.7195 31.3079 12.9729 11.4847 15.4685 25.7135 2.4234 50.5884 14.4419 40.6971 2.5645 38.8005 29.0775 12.9587 0.2035 0.6859 1.5154 0.7988 3.8080 28.1321 7.2926 117.8385 38.2219 2.7705 7.9138 23.3413 13.8126 11.9564 2.7793 19.9093 26.5913 9.9668 15.3585 3.6647 0.3891 1.8504 6.9831 5.9112 39.0462 6.5031 3.0561 1.2909 11.7911 7.2678 34.3613 35.5555 37.7724 24.4375 113.0511 3.3596 1.2319 29.9808 4.4467 668.4546 61.0410 50.0058 204.9328 44.9667 53.3401 72.0399 28.3531 45.8110 11.1183 32.0559 13.4895 39.9070 41.4912 44.4753 8.7872 3.4561 12.9269 8.3153 44.5736 6.2144 27.4361 9.3264
temp: 298.150 k
press: 1.00000 atm
elementType: 8 8 7 7 7 7 6 6 6 6 6 6 6 6 6 6 6 6 6 6 6 6 6 6 6 1 1 1 1 1 1 1 1 1 1 1 1 1 1 1 1 1 1 1 1 1 1
symmnumber: 1
zpe: 996698.8 jmol-1
zpe.correction: 0.379623 hartree
zpe.thermalcorrener: 0.402540 hartree
zpe.thermalcorrenthalpy: 0.403484 hartree
zpe.thermalcorrgfe: 0.323205 hartree
zpe.sumelectzpe: -1104.744787 hartree
zpe.sumelectthermal: -1104.721869 hartree
zpe.sumelectthermalent: -1104.720925 hartree
zpe.sumelectthermalfe: -1104.801204 hartree
dipole: -2.3972 -3.4388 -1.2112
dipole: 4.3634
quadrupole: -160.4741 -143.7984 -141.3262
quadrupole: -2.1753 -9.9827 1.7200
quadrupole: -11.9412 4.7345 7.2067 -2.1753 -9.9827 1.7200
hfenergy: -1105.1244091 hartree
pointgroup: C01 [X(C19H22N4O2)]
dipole: -0.8793451 1.3796764 0.5198386 debye
polarizability: 352.6107854|-53.2579758|211.7483783|12.5398423|-0.4507878|184.7262837 unknown
InChI: InChI=1S/C19H22N4O2/c20-22-21-18-15-17(14-16-4-2-1-3-5-16)6-7-19(18)25-13-10-23-8-11-24-12-9-23/h1-7,15H,8-14H2
charge 0 multiplicity 1
47 atoms
O  6.73725 0.288878 -1.554097
O  1.600928 -0.120648 0.780682
N  4.4857 0.538371 0.246737
N  0.648049 -2.594301 -0.22467
N  1.866393 -2.650679 0.111348
N  2.981609 -2.963479 0.366898
C  4.996359 1.710765 -0.501411
C  5.56555 -0.445046 0.510604
C  3.687761 0.894092 1.435232
C  5.65163 1.246269 -1.813739
C  6.206333 -0.87452 -0.8185
C  2.219921 1.176653 1.098686
C  0.303901 -0.140633 0.265357
C  -2.33359 -0.430167 -0.791724
C  -3.727978 -0.580233 -1.399147
C  -0.142469 -1.40842 -0.220025
C  -0.571247 0.967448 0.210683
C  -1.454098 -1.534294 -0.734089
C  -1.873807 0.821943 -0.312326
C  -4.860061 0.047643 -0.586958
C  -5.796573 0.915621 -1.201707
C  -5.016868 -0.250367 0.792229
C  -6.867753 1.470316 -0.462772
C  -6.084756 0.299839 1.533533
C  -7.016341 1.163065 0.908435
H  4.15865 2.394696 -0.739593
H  5.746516 2.286713 0.099967
H  5.125678 -1.333188 0.999465
H  6.3590 -0.02432 1.178579
H  4.100234 1.784769 1.973589
H  3.7121 0.048717 2.146936
H  4.881757 0.775654 -2.462639
H  6.122129 2.090406 -2.344957
H  7.071916 -1.535696 -0.649482
H  5.448298 -1.398165 -1.438706
H  1.70064 1.628835 1.969465
H  2.12558 1.855634 0.227597
H  -3.73335 -0.134142 -2.413844
H  -3.934571 -1.659762 -1.54054
H  -0.246151 1.94329 0.584041
H  -1.766159 -2.519867 -1.096087
H  -2.544338 1.687946 -0.336027
H  -5.687876 1.158469 -2.266445
H  -4.2934 -0.912091 1.283764
H  -7.581906 2.139697 -0.955927
H  -6.192504 0.056591 2.596861
H  -7.845183 1.590694 1.483726
