program: Gaussian 09
title: 000001663
version: EM64L-G09RevD.01
frameworkgroup: C1[X(C7H10N2O)]
method: RPBEPBE
basis: SDD
operation: Freq
keyword: #p
keyword: freq=noraman
keyword: PBEPBE/SDD
title: #p freq=noraman PBEPBE/SDD
converged: YES YES NO NO
title: Mulliken charges:
elementType: O N N C C C C C C C H H H H H H H H H H
charge: -0.442237 -0.311106 -0.582244 0.458815 -0.450006 -0.568581 -0.391618 0.315285 -0.184974 -0.412003 0.243438 0.190523 0.256820 0.269444 0.222777 0.218449 0.252222 0.264662 0.298373 0.351963
chargesum: 0.00000
title: Mulliken charges with hydrogens summed into heavy atoms:
elementType: O N N C C C C C C C
charge: -0.090274 -0.058884 -0.019209 0.458815 -0.016045 -0.311762 -0.122174 0.315285 0.037803 -0.193554
polarizability: 1.32416634e+02 -3.52561735e-01 9.58632998e+01 5.96825983e+00 -7.43663085e-01 4.83944598e+01
1716.lowfreq: -8.5001 -0.0006 -0.0005 -0.0005 5.3229 7.8339 42.3836 92.7596 118.5174
frequency: 42.3752 92.7588 118.5152 224.2276 242.1086 295.0667 314.0438 357.5139 384.3628 425.0860 439.6546 459.6227 514.9058 555.8533 626.9590 690.1127 728.2518 747.5400 782.2826 874.8704 890.0515 914.9900 970.4251 982.7554 985.7847 1067.8262 1083.2888 1137.7620 1152.9645 1166.4208 1178.7839 1187.6104 1238.4690 1265.1300 1296.4150 1338.1484 1395.5778 1464.8995 1466.7454 1474.2377 1484.7080 1594.6883 1628.4916 1650.3573 2886.2454 3021.9116 3112.4226 3140.5426 3149.8344 3167.7379 3353.0425 3412.9734 3582.9050 3594.9467
redmass: 3.1972 2.6089 3.6854 4.3752 3.1084 3.7618 2.8152 1.1168 1.3265 2.7399 1.8642 2.2110 7.1700 3.7949 5.4198 2.1312 1.4584 4.6333 1.5311 1.3572 1.4388 2.8359 1.3315 2.6672 3.4685 2.3813 1.6220 1.4248 2.4125 1.1898 1.3106 1.3003 1.5019 3.1395 1.3983 1.4520 5.4394 1.2148 2.1889 2.1838 1.2256 6.5618 6.2656 1.0881 1.0718 1.0873 1.0883 1.0920 1.0918 1.0966 1.0750 1.0474 1.0659 1.0965
irintensity: 3.2009 5.9784 4.7024 2.5502 4.7055 7.1520 20.7808 134.3059 137.1431 57.9110 52.8680 50.1105 1.4677 4.8212 3.8585 25.5220 83.8090 20.0091 61.8397 10.6658 9.7015 30.3640 2.5031 8.6778 12.2743 4.3849 15.8391 117.2757 12.4918 19.6835 27.7178 13.3508 2.2201 44.9108 6.7485 13.2596 21.5313 7.6766 28.4892 22.6931 7.6549 56.2552 49.5582 5.8998 85.8201 16.4376 14.7484 19.7259 5.1329 8.3840 12.9811 25.8037 31.4338 3.1488
temp: 298.150 k
press: 1.00000 atm
elementType: 8 7 7 6 6 6 6 6 6 6 1 1 1 1 1 1 1 1 1 1
symmnumber: 1
zpe: 426798.9 jmol-1
zpe.correction: 0.162559 hartree
zpe.thermalcorrener: 0.172500 hartree
zpe.thermalcorrenthalpy: 0.173444 hartree
zpe.thermalcorrgfe: 0.127068 hartree
zpe.sumelectzpe: -456.665871 hartree
zpe.sumelectthermal: -456.655930 hartree
zpe.sumelectthermalent: -456.654986 hartree
zpe.sumelectthermalfe: -456.701362 hartree
dipole: -0.0443 0.6865 -1.5782
dipole: 1.7216
quadrupole: -41.9951 -58.6816 -61.8060
quadrupole: -5.4266 -3.9301 0.8050
quadrupole: 12.1658 -4.5207 -7.6451 -5.4266 -3.9301 0.8050
hfenergy: -456.8284303 hartree
pointgroup: C01 [X(C7H10N2O1)]
dipole: -0.035803 -0.0506685 0.6744792 debye
dipolederiv: -0.9077982 0.6142791 -0.1744873 0.7043393 -0.6578381 0.0076665 -0.192854 0.0073648 -0.41262 -0.0129148 -0.0220795 -0.1877385 0.0330606 -0.4618551 0.1303791 0.0613503 0.1709029 -0.0313124 -0.205596 0.0947069 0.020553 -0.0724049 0.0223533 0.0218774 -0.106723 -0.0371295 -0.7471487 0.2320277 -0.0423855 -0.0760088 0.0204462 0.1412671 -0.0468775 -0.1928825 -0.0674126 0.0025505 0.2835892 -0.0700371 0.1475856 0.0860064 0.3982917 -0.059466 0.2893603 -0.0553035 0.2791725 -0.3834842 0.2164941 -0.060293 -0.0244951 -0.0414352 -0.0600765 0.025979 -0.0902764 -0.164892 -0.225735 -0.1270609 0.0397669 -0.127752 -0.168989 0.0067349 0.0841366 0.0165903 -0.2101012 0.9123685 -0.5898355 0.1163719 -0.6702498 0.5798946 -0.103595 0.1436884 -0.1067668 0.1138208 0.2055167 0.0623774 -0.0588089 -0.0623791 0.1118049 -0.0771835 -0.0191748 -0.0976718 -0.0920099 -0.1188609 -0.0094497 -0.015542 0.3116735 -0.2763474 -0.0191581 -0.1204238 0.0176731 -0.2233021 -0.0115824 0.00775 0.0715759 0.0249151 0.037596 -0.068917 0.0065518 -0.044922 -0.0779756 -0.0323136 0.0219767 -0.0377537 0.0090039 -0.2522509 0.1139661 -0.0813208 0.0447014 0.0115794 0.0959813 -0.0444641 0.0229332 -0.0280647 -0.0313114 0.0713691 0.0176766 0.0726802 0.1400605 0.0455532 0.0951762 -0.0078531 0.0992564 0.0445339 0.0357916 -0.0076414 0.0382538 0.1488478 0.0640258 -0.0432727 0.0218662 -0.0502878 -0.0902336 0.0895505 0.0209305 0.0906166 0.1173095 -0.1451693 -0.0290358 0.0458866 -0.0085206 0.0870477 0.0339489 0.0439306 0.0383866 0.1604521 0.0135579 0.0350395 0.0879237 0.0832604 0.2188372 -0.1469342 0.0548053 -0.0657749 -0.0306318 -0.0675609 -0.0677681 -0.0051427 -0.1577637 -0.0119533 -0.0561266 -0.0125961 -0.0901336 0.331122 0.0273748 0.0237424 -0.0144115 0.0164276 0.1133189 0.0547969 -0.0992759 0.0915893 0.3348847 0.2310203 -0.1261535 0.0635764 -0.1864715 0.2372688 0.0722534 0.0844828 0.0666322 0.3501941 unknown
polarizability: 132.4786343|-2.955612|90.4927074|-4.4685579|-15.1263372|53.703052 unknown
InChI: InChI=1S/C7H10N2O/c8-9-5-6-2-1-3-7(10)4-6/h1-4,9-10H,5,8H2
charge 0 multiplicity 1
20 atoms
O  -3.032274 1.580137 -0.417003
N  2.728899 -0.026261 0.408397
N  4.091195 0.200857 0.074486
C  0.347754 0.064328 -0.275858
C  1.779394 0.456348 -0.623912
C  -0.70645 0.984267 -0.473567
C  0.057636 -1.233419 0.224503
C  -2.038726 0.607318 -0.189332
C  -1.274877 -1.597908 0.510331
C  -2.335126 -0.684893 0.304438
H  2.093488 -0.013109 -1.574668
H  1.833228 1.560706 -0.781518
H  -0.514544 1.995259 -0.84871
H  0.884023 -1.931864 0.386746
H  -1.497628 -2.599983 0.893972
H  -3.370578 -0.974232 0.528033
H  2.459896 0.290775 1.354429
H  4.49013 1.127342 0.269744
H  4.699572 -0.592366 0.276565
H  -3.926611 1.225398 -0.186776
