program: Gaussian 09
title: 000131233
version: EM64L-G09RevD.01
frameworkgroup: C1[X(C13H23N3O2)]
method: RPBEPBE
basis: SDD
operation: Freq
keyword: #p
keyword: freq=noraman
keyword: PBEPBE/SDD
title: #p freq=noraman PBEPBE/SDD
converged: NO YES NO NO
title: Mulliken charges:
elementType: O O N N N C C C C C C C C C C C C C H H H H H H H H H H H H H H H H H H H H H H H
charge: -0.455346 -0.279720 -0.135123 -0.132994 -0.619737 -0.054804 -0.425069 -0.369513 -0.072230 -0.373665 -0.355712 -0.714986 -0.283949 -0.357349 -0.229202 0.034726 -0.696137 0.152311 0.227437 0.257506 0.197386 0.192045 0.214502 0.201118 0.192926 0.194628 0.192913 0.187691 0.226656 0.249712 0.213627 0.302522 0.197172 0.194512 0.266588 0.348820 0.211544 0.209134 0.215996 0.348514 0.325551
chargesum: 0.00000
title: Mulliken charges with hydrogens summed into heavy atoms:
elementType: O O N N N C C C C C C C C C C C C C
charge: -0.106525 -0.279720 -0.135123 -0.132994 0.054327 0.172633 0.029823 0.037035 0.128888 0.013889 0.024892 -0.024992 0.018573 0.034335 0.037386 0.034726 -0.059463 0.152311
polarizability: 1.71043467e+02 -1.86666467e+01 1.80123580e+02 2.89929156e+00 -1.87045350e-01 1.48351733e+02
1716.lowfreq: -13.6037 -8.6926 -4.3005 -0.0005 -0.0002 0.0007 15.8702 24.4815 30.3848
frequency: 15.4969 23.9750 30.3826 45.5078 56.8837 61.4910 79.4372 102.7031 106.1587 120.3802 136.2953 152.8427 170.8435 216.8478 219.3831 231.4275 236.2397 268.6743 276.5895 314.9638 332.7275 392.4191 409.7312 417.0249 435.4934 479.4376 511.7392 535.1327 547.4799 628.4177 639.6444 654.1017 663.8256 709.2454 723.7190 744.7037 746.0446 780.2024 801.8289 830.8121 849.3946 884.2758 889.0423 912.1024 943.5049 973.3784 1001.2470 1007.0724 1020.7042 1045.5013 1059.5169 1063.1080 1070.8498 1075.0899 1077.8176 1089.1530 1107.6517 1125.2799 1138.8037 1191.6368 1198.5918 1207.8895 1231.3377 1233.8116 1244.3261 1263.4737 1272.4013 1282.7144 1288.1065 1293.9315 1300.6877 1309.9548 1322.9951 1333.7732 1354.2407 1356.6865 1373.8530 1377.9054 1386.0363 1388.9021 1392.1700 1445.8618 1462.4734 1462.9367 1467.4866 1468.1335 1474.6499 1474.7153 1475.9845 1482.5312 1488.5108 1542.0007 1581.1409 1629.7370 2943.3926 2951.9175 2954.2935 2960.9688 2968.5175 2972.1475 2979.2638 2981.1994 2988.1869 3001.6536 3016.0582 3019.3904 3036.7330 3065.5791 3068.4418 3071.0554 3072.5060 3092.6362 3232.8722 3260.3771 3499.1678 3575.1569 3673.4012
redmass: 4.3519 1.6632 4.5324 3.5601 4.0233 3.6390 3.8283 5.0055 1.7297 3.4546 2.5958 3.1292 4.3732 3.3973 1.1615 1.8377 1.7708 2.7660 1.0818 5.0294 3.5725 3.6308 3.2813 3.5460 3.2140 3.0703 4.6900 1.4788 2.4117 3.1896 3.4996 1.2709 2.3128 1.9501 1.0900 2.0412 1.4211 1.6856 1.3250 1.8194 2.4822 1.3167 1.8652 2.0739 5.4417 1.4773 2.8150 2.9473 3.1470 2.5303 1.5748 1.9583 1.8925 2.5500 2.2568 2.0037 1.8680 2.0994 2.6168 1.6855 1.3636 1.3967 1.4944 1.8114 2.3011 1.4679 1.3118 1.0935 1.2495 1.1317 1.3724 1.2456 4.1369 1.4436 1.6059 1.6393 1.8369 4.2301 1.7359 1.2166 1.2598 3.1768 1.0770 1.0685 1.0653 1.0734 1.0600 1.0655 1.0444 1.0831 1.0906 3.1847 1.7388 5.2327 1.0839 1.0588 1.0594 1.0603 1.0593 1.0364 1.0644 1.0379 1.0969 1.0996 1.0835 1.1022 1.1037 1.0982 1.1006 1.0993 1.0989 1.0995 1.0980 1.1010 1.0459 1.0664 1.1034
irintensity: 0.6030 0.0649 1.5161 0.7765 1.7140 1.8592 2.0907 8.5963 0.9881 3.1787 0.5086 3.2073 1.6852 1.1705 0.0814 4.9441 2.3634 3.4087 145.4098 3.7418 5.3834 6.4847 0.8490 3.3691 5.2303 4.6806 0.4513 121.4153 27.2423 6.3623 12.2966 145.9003 9.4472 8.1413 16.0114 25.5812 9.7237 13.7493 17.0359 31.8176 10.8494 5.0983 3.9914 10.6311 19.6344 14.1103 9.5061 8.8986 1.5614 3.2114 85.2313 1.6476 23.4996 0.7358 4.0746 4.0169 14.3926 10.0023 5.8509 2.2027 14.6640 26.6626 4.4482 29.7278 83.0570 9.7076 9.9338 0.6312 3.8686 0.3521 0.7566 3.5188 94.2788 0.8741 2.9129 4.1103 6.2182 30.4120 18.3572 11.2154 17.4176 30.5521 0.9884 0.3159 9.6132 1.6111 7.7641 7.1756 12.0196 3.1204 23.7673 6.7443 282.1009 264.9282 36.0101 0.3375 1.4695 13.1757 97.0670 36.9268 38.3296 19.7107 0.3915 0.2437 24.6841 0.1409 77.3403 22.9407 108.0443 54.5232 33.8674 23.9250 0.8790 2.6823 41.8082 5.0204 59.0292
temp: 298.150 k
press: 1.00000 atm
elementType: 8 8 7 7 7 6 6 6 6 6 6 6 6 6 6 6 6 6 1 1 1 1 1 1 1 1 1 1 1 1 1 1 1 1 1 1 1 1 1 1 1
symmnumber: 1
zpe: 918913.0 jmol-1
zpe.correction: 0.349995 hartree
zpe.thermalcorrener: 0.370819 hartree
zpe.thermalcorrenthalpy: 0.371763 hartree
zpe.thermalcorrgfe: 0.297072 hartree
zpe.sumelectzpe: -822.483189 hartree
zpe.sumelectthermal: -822.462366 hartree
zpe.sumelectthermalent: -822.461421 hartree
zpe.sumelectthermalfe: -822.536113 hartree
dipole: -0.7366 4.2301 1.8720
dipole: 4.6841
quadrupole: -111.5994 -102.6210 -114.5187
quadrupole: 9.3587 7.0292 -10.4248
quadrupole: -2.0197 6.9587 -4.9390 9.3587 7.0292 -10.4248
hfenergy: -822.8331848 hartree
pointgroup: C01 [X(C13H23N3O2)]
dipole: -0.3194517 1.6475596 0.7613317 debye
polarizability: 171.6927327|-18.8558531|179.4666016|2.6369081|0.3192624|148.3594455 unknown
InChI: InChI=1S/C13H23N3O2/c1-3-4-5-6-7-12(10(2)17)16-8-11(13(14)18)15-9-16/h8-10,12,17H,3-7,14H2,1-2H3
charge 0 multiplicity 1
41 atoms
O  0.29555 4.05593 -0.377703
O  2.990906 -2.671717 -1.868583
N  1.119697 0.52117 0.419521
N  2.322287 -1.120365 1.423525
N  3.637227 -3.298994 0.295519
C  0.319817 1.759578 0.261867
C  -1.01342 1.487173 -0.472133
C  -1.952339 0.527725 0.290676
C  1.164724 2.861971 -0.43616
C  -3.26817 0.254406 -0.471676
C  -4.225903 -0.688886 0.290377
C  2.517997 3.126763 0.24107
C  1.564092 -0.322279 -0.599845
C  -5.533195 -0.984577 -0.479551
C  1.604006 -0.001081 1.621272
C  2.303038 -1.328689 0.02905
C  -6.487296 -1.920989 0.292752
C  2.994336 -2.478393 -0.611897
H  0.097838 2.123733 1.284235
H  -1.50548 2.464492 -0.624221
H  -0.799777 1.077058 -1.480599
H  -2.18965 0.960994 1.28508
H  -1.436041 -0.434894 0.480385
H  1.325978 2.572525 -1.498571
H  -3.784191 1.215968 -0.675042
H  -3.031697 -0.188199 -1.461861
H  -3.705068 -1.645181 0.505691
H  -4.475869 -0.242437 1.275757
H  2.37227 3.43176 1.293374
H  3.161885 2.230365 0.21957
H  3.061863 3.937048 -0.280627
H  1.336663 -0.176785 -1.650705
H  -5.282767 -1.437714 -1.460454
H  -6.050046 -0.028558 -0.701628
H  1.400201 0.464432 2.582798
H  0.79691 4.835602 -0.724653
H  -6.004793 -2.894873 0.499687
H  -6.777076 -1.47821 1.264497
H  -7.413268 -2.117616 -0.278331
H  3.588715 -3.067809 1.289732
H  4.143144 -4.116851 -0.037096
