program: Gaussian 09
title: 000131209
version: EM64L-G09RevD.01
frameworkgroup: C1[X(C20H30NO3)]
method: RPBEPBE
basis: SDD
operation: Freq
keyword: #p
keyword: freq=noraman
keyword: PBEPBE/SDD
title: #p freq=noraman PBEPBE/SDD
converged: NO YES NO NO
title: Mulliken charges:
elementType: O O O N C C C C C C C C C C C C C C C C C C C C H H H H H H H H H H H H H H H H H H H H H H H H H H H H H H
charge: -0.286186 -0.217990 -0.441535 -0.100378 -0.085385 -0.072627 -0.509588 -0.510454 -0.544650 -0.565996 0.016826 -0.585590 -0.567388 0.249146 -0.560397 -0.384918 -0.226729 -0.379565 0.485006 -0.438718 -0.418176 -0.222524 -0.247557 -0.237834 0.291561 0.293815 0.282690 0.272827 0.265255 0.282501 0.306209 0.254594 0.265051 0.276057 0.268370 0.265517 0.264778 0.286925 0.265503 0.286003 0.264157 0.270213 0.248961 0.234300 0.232190 0.193517 0.221215 0.207092 0.232789 0.251064 0.363451 0.234348 0.233583 0.238670
chargesum: 1.00000
title: Mulliken charges with hydrogens summed into heavy atoms:
elementType: O O O N C C C C C C C C C C C C C C C C C C C C
charge: -0.286186 -0.217990 -0.078084 -0.100378 0.206177 0.221189 0.045929 0.037302 0.016154 -0.024888 0.285197 0.231630 0.248275 0.249146 -0.041223 0.081572 -0.033212 0.048741 0.485006 -0.205929 -0.167112 0.011823 -0.013974 0.000836
polarizability: 2.84621817e+02 2.19390916e+01 1.85758648e+02 -7.28886364e+00 1.61759813e+01 1.91019524e+02
1716.lowfreq: -28.3287 -6.4835 -1.2909 -0.0007 -0.0005 0.0011 6.1728 16.9295 27.1923
frequency: -19.0535 15.1187 26.6937 42.1700 44.1800 52.0153 66.0025 75.4908 91.3594 130.0699 134.9853 147.3470 174.7338 191.1097 221.5710 224.1142 244.7342 270.6106 281.7935 291.3724 315.6670 332.4626 363.7487 373.9561 378.5297 384.6711 408.8188 413.6532 421.7143 465.6044 478.6269 506.6204 523.6565 545.7929 553.0807 559.5089 615.2358 632.8552 644.9657 663.4850 672.5601 709.2325 745.0287 747.0076 768.6916 802.7237 807.0212 815.4476 852.5645 856.5457 865.2943 871.8453 880.7458 889.3639 908.3550 914.4019 920.1125 948.4958 969.4808 979.3563 981.1912 982.4825 989.9684 1000.4576 1000.9538 1012.1845 1027.5729 1030.1678 1039.6230 1050.3861 1062.7852 1074.7901 1082.9558 1087.8702 1091.1173 1103.4085 1124.5902 1156.0337 1160.0151 1163.1078 1163.7726 1166.3786 1176.4138 1189.6841 1191.4300 1200.8965 1210.3019 1227.2559 1228.8325 1249.5095 1255.9072 1269.8438 1278.5605 1294.8935 1298.6581 1307.1966 1312.2172 1318.1288 1322.7229 1325.2301 1334.2766 1337.1690 1345.0519 1354.3106 1370.7619 1372.6106 1376.5508 1382.7164 1415.8129 1432.7061 1441.0074 1446.4212 1457.3946 1459.9239 1463.1648 1469.9118 1477.2770 1479.8159 1484.0486 1493.4927 1496.5804 1511.9938 1515.5037 1590.0918 1611.3023 1658.3488 2961.0663 2981.9735 2987.3074 3012.9444 3015.7865 3022.8256 3025.4071 3030.9009 3034.1592 3034.5743 3037.8810 3044.9862 3059.9930 3062.5756 3067.3586 3078.0272 3078.4394 3081.1794 3092.7123 3110.9729 3114.8103 3126.5884 3130.2029 3137.4844 3139.8931 3149.4871 3167.4905 3172.6785 3183.3767 3543.3408
redmass: 3.9239 4.6049 4.4715 4.0231 3.4099 5.5016 4.5197 4.4675 3.5251 1.1832 4.4721 4.2428 3.0015 2.0443 1.3770 3.0511 4.1194 2.8734 2.4004 2.5254 4.1726 4.1206 2.3109 1.5893 2.0176 2.9242 2.5018 2.1789 2.5149 3.6894 2.2009 3.5288 2.9449 2.7126 3.9810 3.5687 6.0736 3.4057 3.0763 3.8963 5.8948 1.6989 2.9741 2.6535 1.9038 1.7011 2.0398 2.6193 2.6083 1.2564 3.2368 3.3005 1.5020 3.2462 3.3559 2.9556 1.4599 2.5429 1.9134 1.3980 2.1728 3.8048 5.8443 2.2294 1.3440 1.8181 2.2377 1.5782 2.1154 3.1718 2.4424 1.9871 2.0971 1.3355 1.9963 1.9915 1.2082 1.8784 1.4555 1.2811 1.3425 1.6182 1.0574 1.4864 1.1201 1.4340 1.5392 1.4434 1.3008 1.4845 1.4993 1.3713 1.8432 1.4446 1.4316 1.5647 1.1527 1.3265 1.3927 1.4100 1.3882 1.3751 1.3807 1.4481 1.3132 1.3505 1.5774 4.7299 1.1326 1.0867 2.1287 1.1592 1.0542 1.0557 1.0976 1.1109 1.0561 1.0557 2.1345 1.0740 1.0619 1.0811 1.0590 5.9422 6.0909 9.9630 1.0791 1.0680 1.0612 1.0606 1.0822 1.0642 1.0624 1.0364 1.0358 1.0965 1.0631 1.0658 1.0862 1.0993 1.0887 1.1016 1.1029 1.1017 1.1037 1.1041 1.0884 1.0858 1.1047 1.1044 1.0906 1.0957 1.1014 1.1015 1.1006 1.0658
irintensity: 0.5128 0.9151 1.0807 0.3794 5.0877 0.1690 0.7796 1.5134 1.6837 0.1732 2.6139 5.1015 1.7786 0.4079 1.8355 8.0759 0.9405 1.7742 4.3775 4.4067 5.2073 3.7180 46.1276 138.3652 6.2013 6.9639 20.9879 0.4748 5.7814 0.2368 2.0759 0.2309 7.7697 1.5143 8.3816 14.8939 0.2897 1.7447 1.2618 2.9850 2.6593 41.6530 9.0129 14.9440 47.6714 0.6807 5.0202 0.4655 49.5880 1.0513 19.2349 4.6298 1.6022 14.9224 54.1449 12.9686 4.3980 57.0145 7.8524 0.6578 3.0566 79.9543 0.4465 1.9078 0.1767 2.8243 5.7161 15.5618 138.1135 131.1752 21.9778 71.9671 83.2250 11.2203 1.9538 81.6690 7.6891 5.2314 24.7268 0.3330 0.6854 1.9127 0.4099 0.7810 0.5066 2.5081 12.4310 1.4687 5.2068 23.0673 16.8276 30.6252 4.8554 0.4860 10.2775 52.7775 8.1729 2.0692 2.6274 3.8277 7.8685 7.4749 40.2026 0.9785 13.4843 4.3006 0.6223 0.4164 7.8478 23.3139 10.9900 28.6239 9.1597 4.8263 10.1268 10.4747 41.5840 45.1872 20.1802 44.6268 2.5793 18.1157 4.6147 2.1224 6.0194 115.9410 15.5591 57.6675 22.3089 11.5871 6.1659 7.2030 5.7501 3.0209 8.8495 1.5613 4.9221 12.2606 16.3854 68.6787 13.0872 0.8608 13.0042 15.7578 0.2077 19.7986 9.8531 4.2743 0.6884 4.8225 8.6347 32.1307 17.6510 3.9164 2.5822 5.0803
temp: 298.150 k
press: 1.00000 atm
elementType: 8 8 8 7 6 6 6 6 6 6 6 6 6 6 6 6 6 6 6 6 6 6 6 6 1 1 1 1 1 1 1 1 1 1 1 1 1 1 1 1 1 1 1 1 1 1 1 1 1 1 1 1 1 1
symmnumber: 1
zpe: 1231594.7 jmol-1
zpe.correction: 0.469090 hartree
zpe.thermalcorrener: 0.492103 hartree
zpe.thermalcorrenthalpy: 0.493047 hartree
zpe.thermalcorrgfe: 0.415007 hartree
zpe.sumelectzpe: -1058.461030 hartree
zpe.sumelectthermal: -1058.438017 hartree
zpe.sumelectthermalent: -1058.437073 hartree
zpe.sumelectthermalfe: -1058.515113 hartree
dipole: 21.3623 -0.3246 3.6977
dipole: 21.6824
quadrupole: 22.5672 -138.3603 -130.0897
quadrupole: -0.5316 4.6926 5.5014
quadrupole: 104.5281 -56.3993 -48.1288 -0.5316 4.6926 5.5014
hfenergy: -1058.9301198 hartree
pointgroup: C01 [X(C20H30N1O3)]
dipole: 8.3364212 -1.3646103 1.187959 debye
polarizability: 285.6500549|17.0824431|170.5697616|10.5776292|-0.3514089|205.1801722 unknown
InChI: InChI=1S/C20H30NO3/c1-21(2)17-9-10-18(21)13-19(12-17)24-20(23)11-8-16(14-22)15-6-4-3-5-7-15/h3-7,16-19,22H,8-14H2,1-2H3
charge 1 multiplicity 1
54 atoms
O  1.438909 0.35568 0.721557
O  0.334137 -0.211505 -1.251211
O  -3.744687 2.72043 -0.011533
N  5.49074 -0.754443 0.575301
C  4.610015 -1.382181 -0.564635
C  5.188155 0.766403 0.332727
C  4.998211 -0.51136 -1.792671
C  5.376728 0.894012 -1.205548
C  3.119604 -1.237742 -0.19706
C  3.742176 1.080334 0.77341
C  2.713496 0.251172 -0.026766
C  5.165751 -1.249306 1.975892
C  6.969902 -1.053773 0.338467
C  0.260432 0.126853 -0.052314
C  -0.977725 0.367949 0.780132
C  -2.27882 0.095373 -0.000002
C  -3.553632 0.358255 0.842906
C  -3.719077 1.873385 1.184477
C  -4.827199 -0.152212 0.163476
C  -5.863194 -0.722668 0.948732
C  -5.042627 -0.005709 -1.233772
C  -7.078683 -1.137398 0.361393
C  -6.259361 -0.419579 -1.824343
C  -7.282464 -0.984138 -1.029949
H  4.898642 -2.442555 -0.663327
H  5.918927 1.349973 0.918058
H  5.835832 -0.953583 -2.355832
H  4.1459 -0.451801 -2.487683
H  4.724051 1.690854 -1.595645
H  6.409401 1.177581 -1.465799
H  2.523488 -1.680125 -1.014221
H  2.866946 -1.808896 0.713701
H  3.598665 0.923583 1.856542
H  3.565501 2.156601 0.599854
H  2.551016 0.689266 -1.029076
H  5.381948 -2.328126 2.02694
H  5.803864 -0.711091 2.69439
H  4.114096 -1.07846 2.225569
H  7.127508 -2.139988 0.425234
H  7.27899 -0.718209 -0.658465
H  7.563878 -0.530121 1.103644
H  -0.935503 1.416856 1.132305
H  -0.911509 -0.257128 1.693133
H  -2.284146 -0.950585 -0.357768
H  -2.290178 0.743169 -0.894733
H  -3.451652 -0.168462 1.816212
H  -4.635534 2.01211 1.793362
H  -2.859539 2.245821 1.768086
H  -5.71387 -0.847076 2.02902
H  -4.252686 0.405472 -1.872368
H  -4.57489 2.52854 -0.519324
H  -7.863352 -1.580322 0.984607
H  -6.407056 -0.302348 -2.903774
H  -8.224026 -1.305083 -1.48831
