program: Gaussian 09
title: 000131171
version: EM64L-G09RevD.01
frameworkgroup: C1[X(C20H16O7)]
method: RPBEPBE
basis: SDD
operation: Freq
keyword: #pfreq=noraman
keyword: PBEPBE/SDD
title: #p freq=noraman PBEPBE/SDD
converged: YES YES NO NO
title: Mulliken charges:
elementType: O O O O O O O C C C C C C C C C C C C C C C C C C C C H H H H H H H H H H H H H H H H
charge: -0.230879 -0.254485 -0.350024 -0.304381 -0.184813 -0.397072 -0.417597 0.284585 -0.259267 -0.399568 -0.392235 -0.460512 0.113326 0.270146 -0.724694 -0.040090 0.194410 -0.653518 0.337079 0.033960 -0.279542 0.010931 0.356051 0.176214 -0.565589 0.363924 -0.551003 0.243370 0.230952 0.213227 0.232595 0.220965 0.250677 0.234006 0.228149 0.223923 0.251861 0.316089 0.359652 0.312469 0.255804 0.386217 0.364687
chargesum: 0.00000
title: Mulliken charges with hydrogens summed into heavy atoms:
elementType: O O O O O O O C C C C C C C C C C C C C C C C C C C C
charge: -0.230879 -0.254485 0.009628 -0.304381 -0.184813 -0.010855 -0.052910 0.284585 -0.015898 0.044611 0.061326 0.024172 0.113326 0.270146 -0.020761 -0.040090 0.194410 -0.337429 0.337079 0.033960 -0.279542 0.010931 0.356051 0.176214 -0.253120 0.363924 -0.295199
polarizability: 4.48043255e+02 -1.31414867e-01 2.57975431e+02 5.94659333e+00 -4.92727765e+00 1.23209467e+02
1716.lowfreq: -7.1856 -0.0008 0.0002 0.0004 4.9724 9.9978 28.9913 40.0343 60.7383
frequency: 28.9005 39.7613 60.7272 82.4524 113.9410 115.4356 141.0040 172.2696 178.8257 193.5812 206.7844 223.0078 229.9977 255.3242 269.3639 275.6132 283.4547 299.0609 303.0792 331.7638 350.4639 370.9146 390.0275 400.1514 403.1264 407.6468 426.0481 442.1014 453.5740 463.9412 479.7876 504.9776 512.7182 528.6642 552.4945 560.7036 582.9182 594.0156 601.4293 613.0936 626.7902 674.1648 687.0910 707.2107 721.7408 739.7012 750.4067 773.2861 774.9826 806.9518 841.5600 846.8892 847.1920 854.9828 875.1548 910.5561 923.2459 934.7810 942.5140 951.4500 975.4531 1000.7106 1004.2901 1007.2485 1026.5526 1049.7503 1083.6962 1098.5455 1106.5940 1127.1772 1143.0690 1158.8223 1170.3780 1180.0154 1192.2391 1195.1921 1210.7981 1231.3843 1231.8239 1261.6643 1273.5872 1283.5904 1321.1754 1325.8696 1332.8828 1342.4581 1349.2684 1356.2745 1361.0585 1393.2815 1407.4973 1424.9499 1427.1176 1430.6427 1441.4607 1450.8277 1459.9546 1465.8218 1467.3242 1469.9649 1478.6954 1541.6715 1556.5601 1569.0521 1587.0683 1609.9471 1636.4388 2534.2789 2983.9548 2997.4002 2998.3204 3006.8719 3012.3380 3048.2989 3062.3245 3074.3039 3116.4429 3123.4233 3149.1912 3177.2629 3183.5811 3544.3036 3576.8264
redmass: 6.5619 5.6389 5.9649 5.1894 9.7802 5.7448 8.2583 5.3534 3.1788 1.1201 3.9728 5.2428 5.4226 2.8008 3.7398 4.7512 4.9412 3.6993 1.6102 4.9383 3.3644 5.3890 3.6412 3.0511 1.2134 6.1132 5.8220 5.8941 8.0641 4.7258 5.8109 6.2224 6.0166 5.5257 6.8703 4.2282 5.3425 3.9305 6.5651 4.8890 4.0877 5.8715 4.6878 5.5324 5.2360 5.5785 4.5052 6.6334 6.1390 3.1688 2.6000 2.6463 2.0553 2.7157 1.7203 1.4821 4.2071 3.4302 1.9422 2.9025 3.6833 2.1491 1.0715 4.2315 1.7696 3.1116 1.6793 2.6788 2.2688 1.7634 2.1460 1.5471 1.7980 1.7409 1.7935 1.5990 2.1823 2.1229 2.4953 1.3063 1.6870 2.0768 5.9930 4.7941 1.5163 1.4129 1.5454 1.6947 4.5211 1.2733 6.3521 3.8748 6.9804 6.9800 1.0906 1.0980 1.0653 1.2093 2.8186 4.1789 1.0963 6.3699 4.5513 6.0802 5.5533 7.1011 5.5835 1.0742 1.0685 1.0754 1.0619 1.0646 1.0362 1.1016 1.1002 1.1028 1.1003 1.1006 1.0923 1.0921 1.0926 1.0653 1.0660
irintensity: 2.6106 0.3024 2.2536 0.6841 0.4437 0.7476 0.3504 1.5559 1.1541 0.1695 0.0962 1.6615 0.3680 2.8162 1.3113 1.5648 0.1272 1.5085 77.9257 8.0657 11.6054 22.9552 8.1691 1.2106 148.0291 25.8035 3.6188 38.3995 2.8551 1.4995 3.0827 2.3187 18.8194 1.5536 11.1902 3.2735 6.7651 7.1934 5.8802 4.8007 9.5598 34.5281 29.9264 44.8011 9.6915 3.5302 1.5112 38.0566 76.6159 41.0202 41.9157 39.1751 10.1400 13.1674 14.1731 1.1677 21.5396 13.1394 33.4287 5.9303 16.8363 41.6129 124.7098 22.9374 44.2405 92.9683 15.8720 16.1632 135.5538 449.1875 35.7102 65.4130 16.4566 42.2680 10.9113 57.2154 34.2775 69.5182 147.4823 42.5192 179.7738 159.2076 736.3192 25.3165 21.3730 1.4080 16.4541 26.9978 377.0443 35.4092 101.0007 27.8665 41.2084 20.5326 5.9471 11.8080 12.4324 20.7381 21.5428 91.6544 13.4650 295.9466 99.2207 28.9975 129.7692 289.4871 124.2147 302.4073 8.5900 41.2315 29.9876 17.0492 16.5369 15.5316 32.2160 44.4998 16.3276 14.3175 6.8200 5.6116 3.6544 23.1543 81.7168
temp: 298.150 k
press: 1.00000 atm
elementType: 8 8 8 8 8 8 8 6 6 6 6 6 6 6 6 6 6 6 6 6 6 6 6 6 6 6 6 1 1 1 1 1 1 1 1 1 1 1 1 1 1 1 1
symmnumber: 1
zpe: 840034.3 jmol-1
zpe.correction: 0.319952 hartree
zpe.thermalcorrener: 0.341760 hartree
zpe.thermalcorrenthalpy: 0.342704 hartree
zpe.thermalcorrgfe: 0.270579 hartree
zpe.sumelectzpe: -1296.409841 hartree
zpe.sumelectthermal: -1296.388034 hartree
zpe.sumelectthermalent: -1296.387090 hartree
zpe.sumelectthermalfe: -1296.459215 hartree
dipole: -5.0509 1.4440 1.5205
dipole: 5.4689
quadrupole: -110.4185 -171.2618 -156.0541
quadrupole: -5.9321 -5.7699 1.8210
quadrupole: 35.4929 -25.3503 -10.1426 -5.9321 -5.7699 1.8210
hfenergy: -1296.7297936 hartree
pointgroup: C01 [X(C20H16O7)]
dipole: -1.9888327 0.5440809 0.6148579 debye
polarizability: 448.0569956|0.5665832|258.138849|5.5224782|-1.5241217|123.0323089 unknown
InChI: InChI=1S/C20H16O7/c1-20-4-2-3-12(26-20)16-13(27-20)7-10-15(19(16)25)18(24)14-9(17(10)23)5-8(21)6-11(14)22/h5-7,12,21-22,25H,2-4H2,1H3
charge 0 multiplicity 1
43 atoms
O  -4.44053 0.351054 -1.050097
O  -3.290722 -1.587946 -0.144645
O  -0.931663 2.70594 -0.276518
O  1.715563 2.638856 -0.143727
O  1.517029 -2.883068 0.083732
O  4.20579 2.599206 -0.042057
O  6.44177 -1.70206 0.222453
C  -4.623243 -0.870972 -0.280364
C  -3.504693 1.289576 -0.366837
C  -5.166415 -0.578269 1.13658
C  -4.10427 1.729607 0.991711
C  -4.341264 0.49265 1.888876
C  -2.156537 0.598637 -0.240609
C  -2.131779 -0.816249 -0.155888
C  -5.493577 -1.800222 -1.111895
C  -0.92786 1.312191 -0.219583
C  0.330299 0.635533 -0.127846
C  -0.907895 -1.513918 -0.083336
C  0.301148 -0.80084 -0.064748
C  1.626767 1.339983 -0.098407
C  1.562997 -1.614074 0.025759
C  2.863065 0.550482 -0.014814
C  2.859555 -0.877258 0.044942
C  4.132289 1.233578 0.00973
C  4.055628 -1.608635 0.123613
C  5.291637 -0.912784 0.1442
C  5.338799 0.494196 0.088633
H  -3.462784 2.141662 -1.07324
H  -5.191185 -1.525119 1.704353
H  -6.211153 -0.232005 1.015221
H  -5.061735 2.248567 0.794348
H  -3.427077 2.446379 1.495287
H  -3.371173 0.067664 2.206288
H  -4.87557 0.790364 2.808785
H  -5.589458 -2.775761 -0.607617
H  -6.49603 -1.360891 -1.245902
H  -5.034284 -1.95337 -2.101324
H  -0.889453 -2.605492 -0.034046
H  -1.853611 3.059975 -0.361972
H  4.029358 -2.69995 0.168012
H  6.284175 1.047922 0.104472
H  3.208981 2.935242 -0.095833
H  7.261512 -1.147081 0.23111
