program: Gaussian 09
title: 000131161
version: EM64L-G09RevD.01
frameworkgroup: C1[X(C6H7ClO7)]
method: RPBEPBE
basis: SDD
operation: Freq
keyword: #p
keyword: freq=noraman
keyword: PBEPBE/SDD
title: #p freq=noraman PBEPBE/SDD
converged: YES YES NO NO
title: Mulliken charges:
elementType: Cl O O O O O O O C C C C C C H H H H H H H
charge: 0.000170 -0.399853 -0.436336 -0.172764 -0.408479 -0.412298 -0.173378 -0.211708 0.211390 -0.573932 -0.495841 0.187371 0.253956 0.209347 0.338304 0.271536 0.276293 0.358703 0.395547 0.397140 0.384835
chargesum: 0.00000
title: Mulliken charges with hydrogens summed into heavy atoms:
elementType: Cl O O O O O O O C C C C C C
charge: 0.000170 -0.041150 -0.040789 -0.172764 -0.011339 -0.027463 -0.173378 -0.211708 0.211390 -0.235628 0.051987 0.187371 0.253956 0.209347
polarizability: 9.84865685e+01 -1.90031597e+00 1.10138995e+02 3.25332100e+00 7.89527757e-01 7.67960699e+01
1716.lowfreq: -9.8639 -7.3153 -4.9907 -0.0025 -0.0021 -0.0016 27.3129 39.3404 53.2764
frequency: 27.2301 39.2468 53.2611 74.4838 92.1813 111.2494 137.7284 177.7990 196.3226 218.9843 232.2450 257.3455 290.6278 332.7479 351.7557 360.4571 443.2511 481.0294 515.5555 540.0485 555.9733 584.7921 592.0354 624.3516 658.9537 667.0332 724.2451 771.9375 781.9833 840.2549 879.7334 914.8347 966.3723 1018.1731 1036.9012 1060.5429 1085.5587 1102.0426 1193.9362 1197.4092 1223.8606 1266.1228 1280.8933 1313.1836 1337.2954 1364.8689 1426.9099 1669.6204 1684.4713 1701.3331 3023.1854 3103.9243 3124.7484 3512.9298 3518.5756 3519.7725 3541.5129
redmass: 8.5401 9.7953 7.1623 6.9248 7.9795 9.7356 7.4157 8.7045 7.9595 7.4811 6.4924 3.2108 1.6547 7.8863 6.4059 3.1709 4.4385 2.8611 2.8787 1.5115 3.1129 2.7859 3.3141 2.0331 1.6373 3.1250 4.7736 6.6564 5.8600 6.1500 3.0485 5.1827 2.6923 3.5843 2.3433 2.7764 3.1316 2.9209 1.1447 1.1745 1.3814 1.6127 1.8298 2.1076 1.7331 1.9183 1.0940 8.8683 9.7420 10.3172 1.0624 1.0981 1.0870 1.0640 1.0643 1.0658 1.0644
irintensity: 1.3731 4.4030 1.6439 0.4222 1.4712 1.6749 0.2941 0.2958 3.9886 4.8532 3.7064 38.3799 104.3259 2.5800 6.0895 2.4923 11.2230 1.9697 41.6031 18.4826 176.8294 90.2078 41.7673 163.7706 116.9292 33.2971 4.0033 25.4158 7.8212 11.4052 27.2694 1.1646 98.8251 168.6587 347.5079 159.4799 74.0479 40.2950 2.0427 27.0511 22.4575 2.6134 12.8430 73.8860 21.0883 94.5364 24.8997 169.2355 173.5443 270.2100 2.0276 0.8849 0.4852 32.9088 47.2983 22.3235 50.3448
temp: 298.150 k
press: 1.00000 atm
elementType: 17 8 8 8 8 8 8 8 6 6 6 6 6 6 1 1 1 1 1 1 1
symmnumber: 1
zpe: 357706.3 jmol-1
zpe.correction: 0.136243 hartree
zpe.thermalcorrener: 0.151358 hartree
zpe.thermalcorrenthalpy: 0.152302 hartree
zpe.thermalcorrgfe: 0.092344 hartree
zpe.sumelectzpe: -1218.389290 hartree
zpe.sumelectthermal: -1218.374175 hartree
zpe.sumelectthermalent: -1218.373231 hartree
zpe.sumelectthermalfe: -1218.433189 hartree
dipole: -0.4754 0.3627 -3.7352
dipole: 3.7828
quadrupole: -77.7319 -85.6791 -90.3660
quadrupole: -10.3374 -1.9314 8.5420
quadrupole: 6.8604 -1.0867 -5.7737 -10.3374 -1.9314 8.5420
hfenergy: -1218.5255328 hartree
pointgroup: C01 [X(C6H7Cl1O7)]
dipole: 0.1717185 -0.0452773 -1.4776289 debye
dipolederiv: -0.2223875 -0.0546664 -0.0244757 -0.0852753 -0.5385575 -0.0664513 -0.0363249 -0.0312347 -0.1411842 -0.6002017 0.0651666 0.0184285 0.1018431 -0.2300882 0.1618777 0.067219 0.1529285 -0.6499223 -0.483578 -0.0272112 0.1265543 -0.0730529 -0.4235623 0.3123427 0.1266684 0.2809735 -1.0503122 -0.3601779 0.08209 0.1391205 0.087739 -0.7422729 -0.325381 0.1315375 -0.0653308 -0.6818591 -0.5343046 0.2943527 -0.2270743 0.2422628 -0.9227839 0.3498538 -0.1595212 0.2404495 -0.43958 -0.977734 0.5545146 0.0797436 0.5145809 -0.6793682 0.0265816 0.0025868 0.0527969 -0.3838832 -0.5757842 -0.0521444 0.2585517 0.1133508 -0.5032788 0.1384334 0.2245416 0.2710658 -0.616 -0.730108 -0.0877253 -0.0946868 0.1742755 -0.8744472 -0.1287251 -0.0466833 -0.1856393 -0.335951 0.5468871 -0.0695739 -0.0449248 -0.0654098 -0.1467356 -0.1683602 -0.0018967 -0.2119834 0.467862 -0.1054235 0.2571672 0.0474026 0.1347263 0.7092828 0.1095222 0.1607659 0.0725474 0.0152361 -0.35475 -0.0439515 -0.0261108 -0.1155732 -0.0590528 -0.1039539 -0.2190085 -0.0478112 -0.0475622 0.4729278 -0.1451157 -0.2722005 0.0517841 1.1833374 0.0626677 -0.2719464 -0.1360114 1.3441302 0.9343579 -0.382626 -0.2292733 -0.4626109 0.9816004 -0.5008009 -0.3808218 -0.4457676 0.802892 1.4437513 -0.2912909 0.1489666 -0.4342456 1.3037909 0.2156608 0.2634514 0.243884 0.3217338 0.0909548 0.0102869 0.0024299 0.004124 -0.0088895 0.015591 0.0053657 0.003474 0.0220265 0.0643269 -0.0173246 -0.0117225 -0.023609 0.1208375 0.0403779 0.0121694 0.0208708 -0.0125037 0.0969945 0.0069772 0.0082628 0.0147491 -0.0273678 0.0134533 0.0205053 0.0281222 0.1127108 0.3721461 -0.0591071 0.0367662 -0.0790521 0.125883 -0.0254988 0.009338 -0.0638334 0.3525012 0.3843042 0.0305828 0.0065561 0.019744 0.1581494 -0.0511174 0.0194714 -0.1086498 0.3279202 0.2849692 0.0237181 0.1163322 0.0108258 0.3429902 -0.0001961 0.1541515 -0.005362 0.2389067 0.2528295 -0.0941191 -0.0586461 -0.1311767 0.2305331 -0.0758774 -0.0815692 -0.0654892 0.3528386 unknown
polarizability: 98.8102959|-2.7659717|109.704134|-3.7352697|0.7351252|76.9072033 unknown
InChI: InChI=1S/C6H7ClO7/c7-3(4(10)11)6(14,5(12)13)1-2(8)9/h3,8,10,12,14H,1H2
charge 0 multiplicity 1
21 atoms
Cl -1.296426 -2.589042 -0.603079
O  0.096403 -0.507761 1.455186
O  0.360931 1.692369 -1.41528
O  -0.142452 2.163578 0.811664
O  -2.875641 1.00577 -0.555036
O  3.648643 -1.214632 -0.135409
O  -3.023956 -0.661909 1.0676
O  2.82106 0.914358 0.281245
C  0.099196 -0.20888 0.035884
C  -1.222273 -0.701383 -0.649735
C  1.338783 -0.830114 -0.660613
C  0.107943 1.345151 -0.080254
C  -2.465087 -0.172353 0.073139
C  2.6329 -0.255093 -0.112618
H  -1.240138 -0.420483 -1.710911
H  1.312318 -0.618896 -1.745759
H  1.338208 -1.922985 -0.525597
H  -0.270861 -1.421363 1.592747
H  0.367153 2.682375 -1.503958
H  -3.613304 1.427902 -0.036028
H  4.495399 -0.808507 0.197112
