program: Gaussian 09
title: 000131149
version: EM64L-G09RevD.01
frameworkgroup: C1[X(C6H13NO8S)]
method: RPBEPBE
basis: SDD
operation: Freq
keyword: #p
keyword: freq=noraman
keyword: PBEPBE/SDD
title: #p freq=noraman PBEPBE/SDD
converged: YES YES NO NO
title: Mulliken charges:
elementType: S O O O O O O O O N C C C C C C H H H H H H H H H H H H H
charge: 1.177037 -0.451437 -0.410663 -0.478801 -0.468376 -0.187563 -0.540308 -0.458850 -0.465897 -0.622663 -0.106050 -0.117103 -0.065683 -0.167390 -0.371065 -0.080845 0.319264 0.261824 0.240132 0.261493 0.206483 0.223529 0.346281 0.331091 0.300527 0.192970 0.386982 0.360570 0.384512
chargesum: 0.00000
title: Mulliken charges with hydrogens summed into heavy atoms:
elementType: S O O O O O O O O N C C C C C C
charge: 1.177037 -0.451437 -0.064382 -0.091819 -0.107806 -0.187563 -0.155796 -0.458850 -0.465897 0.008954 0.213214 0.144721 0.174449 0.094103 0.058947 0.112125
polarizability: 2.13891374e+02 -2.81625408e+01 1.44171191e+02 -1.27060672e+01 9.67954230e+00 1.13931623e+02
1716.lowfreq: -8.7900 -1.5710 -0.0023 -0.0019 -0.0007 8.0287 40.5860 48.5377 53.1597
frequency: 40.5119 48.5133 53.0925 61.5702 70.9976 89.4545 102.3931 114.9685 137.4631 148.4392 167.3116 180.3229 203.1195 227.8958 233.7107 244.0329 265.0985 281.2823 289.5100 313.9420 321.6198 326.6383 353.3385 383.1854 399.6209 451.1888 464.7475 488.9514 498.0203 505.4431 529.0805 556.6678 626.8781 669.5719 731.2159 814.1886 835.2951 854.5285 868.8257 902.9245 953.8842 971.1107 977.5212 980.6248 1048.7888 1052.9648 1062.2441 1079.1485 1090.0814 1116.2340 1157.5870 1180.1622 1197.0761 1202.9255 1217.0571 1271.0372 1280.5813 1309.0711 1324.9852 1341.7206 1347.6389 1357.5801 1370.5969 1381.0514 1409.2296 1463.7694 1603.7162 1647.1850 2920.5807 2930.6750 2957.0971 2965.0058 3030.2938 3032.1735 3075.0921 3474.6826 3497.9968 3511.3438 3544.3259 3598.1026 3655.3429
redmass: 7.2705 6.7835 7.7016 7.2193 7.4336 4.3919 3.2103 3.7792 5.9391 6.1564 3.0131 5.2317 5.6534 2.9713 3.3305 1.2517 4.9399 4.4364 3.3408 3.5878 1.4682 4.3563 7.4193 4.1808 4.4421 1.8095 3.8854 1.4936 1.6283 2.1199 1.9494 7.2887 3.2734 3.5927 4.0193 4.5105 2.7084 8.9108 2.7915 4.8393 1.9355 4.8877 6.1922 5.0801 2.3755 2.4261 1.8094 2.0409 1.3870 1.4083 1.1419 1.1732 1.3414 3.1363 1.1679 1.3489 1.2308 1.2506 1.3503 1.3008 1.4842 1.3242 1.2128 1.4065 1.6590 1.0799 1.5218 2.7599 1.0835 1.0855 1.0757 1.0637 1.0846 1.1066 1.0859 1.0655 1.0477 1.0653 1.0653 1.0670 1.0989
irintensity: 2.1837 4.4478 3.5931 1.3899 3.2042 9.0550 45.8789 1.6455 10.9712 4.4185 39.7301 1.8429 37.9627 17.6548 4.4735 139.9319 28.7992 3.8125 11.3027 19.8345 34.4086 46.4084 3.1351 26.0721 46.4726 41.4425 11.4373 91.5473 169.7183 41.2285 385.6504 59.2537 34.4953 2.2690 18.0179 17.8281 50.6876 88.5397 37.0811 34.1369 9.2382 107.7652 40.4401 56.5075 34.1239 39.9547 13.5164 97.7211 59.8687 10.5527 15.0249 9.2109 28.8818 53.7758 3.8106 46.7927 39.1920 0.3404 7.5578 7.3869 10.6517 4.4959 16.7290 8.3948 3.2732 8.0644 208.8265 114.2241 44.2229 34.6705 13.9975 37.1700 2.3787 39.5717 11.0423 56.1299 89.1490 5.4956 46.6154 7.9697 30.3606
temp: 298.150 k
press: 1.00000 atm
elementType: 16 8 8 8 8 8 8 8 8 7 6 6 6 6 6 6 1 1 1 1 1 1 1 1 1 1 1 1 1
symmnumber: 1
zpe: 546955.7 jmol-1
zpe.correction: 0.208324 hartree
zpe.thermalcorrener: 0.228391 hartree
zpe.thermalcorrenthalpy: 0.229335 hartree
zpe.thermalcorrgfe: 0.159579 hartree
zpe.sumelectzpe: -1289.494377 hartree
zpe.sumelectthermal: -1289.474311 hartree
zpe.sumelectthermalent: -1289.473367 hartree
zpe.sumelectthermalfe: -1289.543123 hartree
dipole: -1.8387 2.6379 1.8140
dipole: 3.6919
quadrupole: -118.6909 -88.2985 -102.0899
quadrupole: 18.7440 -9.0611 3.1443
quadrupole: -15.6644 14.7279 0.9365 18.7440 -9.0611 3.1443
hfenergy: -1289.7027017 hartree
pointgroup: C01 [X(C6H13N1O8S1)]
dipole: 0.638209 1.03351 0.7964187 debye
polarizability: 133.7592808|-5.4544817|222.4164496|5.3207492|18.9886661|115.8184573 unknown
InChI: InChI=1S/C6H13NO8S/c7-3(1-8)6(15-16(12,13)14)5(11)4(10)2-9/h1,3-6,9-12H,2,7H2
charge 0 multiplicity 1
29 atoms
S  -0.932382 -2.369368 -0.236338
O  -0.942661 -0.441596 -0.603192
O  1.121231 1.447491 -1.299027
O  1.601632 -1.366351 1.055341
O  4.147535 -1.516767 -0.072091
O  -1.361724 3.625076 -0.924389
O  -2.362678 -2.5460 -1.364773
O  0.217213 -3.247041 -0.928012
O  -1.379602 -2.606098 1.288515
N  -0.742538 2.590219 1.568127
C  -0.323526 0.404214 0.416446
C  1.114675 0.751697 -0.002572
C  1.996272 -0.512719 -0.075683
C  -1.252791 1.684345 0.574697
C  3.49065 -0.198316 -0.007182
C  -1.43069 2.383657 -0.778129
H  -0.317952 -0.110078 1.395434
H  1.517501 1.485763 0.71488
H  1.794607 -1.056008 -1.025276
H  -2.253058 1.26567 0.833039
H  3.724095 0.312291 0.950427
H  3.779582 0.449286 -0.858926
H  0.716127 0.834634 -1.969426
H  -0.550097 3.539012 1.237038
H  -1.056862 2.495222 2.531119
H  -1.69616 1.694301 -1.61446
H  2.196891 -2.161237 1.045502
H  5.128093 -1.41801 0.001495
H  -2.855181 -1.674988 -1.310283
