program: Gaussian 09
title: 000131144
version: EM64L-G09RevD.01
frameworkgroup: C1[X(C14H14O4)]
method: RPBEPBE
basis: SDD
operation: Freq
keyword: #pfreq=noraman
keyword: PBEPBE/SDD
title: #p freq=noraman PBEPBE/SDD
converged: YES YES NO NO
title: Mulliken charges:
elementType: O O O O C C C C C C C C C C C C C C H H H H H H H H H H H H H H
charge: -0.277848 -0.394124 -0.293794 -0.364117 0.348816 0.183189 -0.034706 0.175997 -0.649638 0.538399 -0.563578 -0.379261 0.103388 -0.357857 -0.826542 0.234368 -0.529691 -0.491992 0.305362 0.244655 0.280689 0.259455 0.227222 0.227093 0.230114 0.389103 0.223164 0.245036 0.223138 0.229692 0.247021 0.247247
chargesum: 0.00000
title: Mulliken charges with hydrogens summed into heavy atoms:
elementType: O O O O C C C C C C C C C C C C C C
charge: -0.277848 -0.005021 -0.293794 -0.364117 0.348816 0.183189 -0.034706 0.175997 -0.344276 0.538399 -0.318922 -0.098572 0.103388 -0.098402 -0.142113 0.234368 0.161647 0.231968
polarizability: 2.53395340e+02 9.50275481e+00 2.14240025e+02 -1.11174927e-02 1.73138817e-02 7.97881426e+01
1716.lowfreq: -9.1324 -3.5069 0.0001 0.0004 0.0006 6.9121 34.3134 64.1292 72.1104
frequency: 34.2126 64.1276 72.1004 100.1691 112.2989 123.0842 139.4882 151.8945 176.8355 187.9512 190.5046 225.6886 262.6270 292.4585 301.8906 324.3741 334.7497 376.9230 415.3839 428.7099 456.8281 477.9529 505.8570 544.5247 572.3929 576.3296 613.0291 651.3042 699.9596 727.3063 729.0939 774.1371 793.2629 829.8926 844.5992 853.4409 908.4396 909.5006 919.9207 939.4236 995.3591 999.6824 1011.8005 1041.1494 1050.1627 1098.1895 1110.7669 1114.1334 1142.1515 1148.2784 1159.9917 1180.6370 1226.8546 1240.2799 1257.6208 1286.1064 1330.9938 1349.0561 1395.9606 1404.1639 1410.4922 1417.5144 1429.9623 1440.0578 1444.7772 1448.3084 1463.9042 1467.4031 1469.6186 1472.8461 1477.6565 1510.7986 1558.1379 1596.7907 1615.3176 1625.3022 2789.8309 2962.6293 2973.5232 3011.0389 3048.9680 3051.2584 3089.3524 3117.7112 3126.3255 3150.2027 3150.7599 3165.4209 3186.2225 3207.0175
redmass: 4.1846 3.9748 1.0610 2.5400 1.6770 2.4711 3.8041 5.4158 3.5343 2.3274 3.7602 3.3827 1.3702 4.9212 4.3627 5.3972 5.6240 3.9726 5.6028 6.6775 7.9208 4.4831 6.3035 5.1646 3.3137 4.4496 5.2759 3.7420 5.7725 5.2028 5.6731 6.2810 3.2351 6.5480 1.4200 1.8774 1.4367 6.9030 6.3819 1.0672 1.3434 1.6863 4.9291 3.2493 1.5635 3.5612 1.2562 1.2602 1.9505 1.4951 1.4746 1.6559 2.1067 2.0217 1.7222 5.4703 3.3100 3.9952 1.2522 3.7219 2.4046 2.5318 2.3806 1.8590 1.3721 1.0510 1.0590 1.0498 1.0463 1.1298 1.1756 3.3249 6.3308 2.9462 5.1102 6.6559 1.0710 1.0327 1.0377 1.0287 1.0973 1.1039 1.0982 1.1049 1.0998 1.0910 1.1056 1.0875 1.0981 1.0910
irintensity: 0.8140 0.6133 1.1776 4.1501 4.4948 0.0098 1.3560 4.5130 1.1597 0.2359 1.6372 2.1098 0.0162 2.5467 0.1040 0.4742 10.0275 7.3636 17.6777 3.3972 3.6386 4.4088 5.8576 11.3097 12.0627 11.9242 3.2289 1.6546 4.4474 0.3742 7.2885 2.4246 0.5506 8.7594 93.4658 0.5271 10.8675 27.0389 13.7489 124.1399 0.7238 12.7163 101.6979 8.4696 14.1642 23.6144 0.0259 0.1624 102.7025 46.5117 23.6231 65.6072 180.6858 136.4139 135.3019 71.4678 283.1175 63.8696 18.8683 25.7451 43.3192 81.9785 96.5933 139.8602 19.1237 12.8946 15.3462 10.3452 17.8309 66.9123 15.4446 2.0034 77.3188 16.6112 284.2835 181.4634 336.7174 72.9434 41.4230 39.1570 17.4945 48.7556 18.6758 21.7764 22.2000 13.4037 13.6244 0.0962 6.3935 8.3050
temp: 298.150 k
press: 1.00000 atm
elementType: 8 8 8 8 6 6 6 6 6 6 6 6 6 6 6 6 6 6 1 1 1 1 1 1 1 1 1 1 1 1 1 1
symmnumber: 1
zpe: 652354.5 jmol-1
zpe.correction: 0.248469 hartree
zpe.thermalcorrener: 0.265403 hartree
zpe.thermalcorrenthalpy: 0.266347 hartree
zpe.thermalcorrgfe: 0.203814 hartree
zpe.sumelectzpe: -841.496110 hartree
zpe.sumelectthermal: -841.479175 hartree
zpe.sumelectthermalent: -841.478231 hartree
zpe.sumelectthermalfe: -841.540765 hartree
dipole: 3.1688 3.8333 -0.0055
dipole: 4.9735
quadrupole: -84.5172 -99.2684 -108.1779
quadrupole: -10.7446 0.0006 0.0142
quadrupole: 12.8040 -1.9473 -10.8567 -10.7446 0.0006 0.0142
hfenergy: -841.7445783 hartree
pointgroup: C01 [X(C14H14O4)]
dipole: 1.2653082 -1.4710304 0.2526395 debye
polarizability: 252.8123105|-7.5311449|212.2567999|13.03894|-15.0335554|82.3543974 unknown
InChI: InChI=1S/C14H14O4/c1-8-6-10-9(12(7-8)17-2)4-5-11(15)13(10)14(16)18-3/h4-7,15H,1-3H3
charge 0 multiplicity 1
32 atoms
O  3.349913 1.285614 0.265158
O  -2.807668 2.638644 -0.319774
O  -2.712056 -1.540199 0.150736
O  -3.896871 0.4083 -0.152664
C  -0.148572 -0.010694 0.160238
C  0.99203 0.880333 0.143215
C  -1.480867 0.573105 0.002486
C  2.317277 0.335109 0.295952
C  0.100043 -1.413027 0.330704
C  1.398994 -1.920426 0.476945
C  2.522386 -1.038137 0.459683
C  0.812822 2.292066 -0.02402
C  -1.603586 1.998809 -0.163397
C  -0.451051 2.841205 -0.17379
C  1.632462 -3.410346 0.654949
C  -2.750825 -0.164277 -0.006453
C  4.723461 0.803784 0.418533
C  -4.029166 -2.226441 0.133634
H  -0.744504 -2.099994 0.346125
H  3.528288 -1.453633 0.574523
H  1.700802 2.929327 -0.030853
H  -0.611376 3.914688 -0.30264
H  2.26787 -3.816239 -0.155367
H  2.149319 -3.624197 1.610039
H  0.681965 -3.969378 0.651874
H  -3.548536 1.9156 -0.294473
H  4.864951 0.301275 1.394957
H  5.351686 1.705159 0.369191
H  4.99839 0.110062 -0.399452
H  -3.784186 -3.288471 0.275499
H  -4.534749 -2.056015 -0.830746
H  -4.666247 -1.848405 0.94959
