program: Gaussian 09
title: 000131124
version: EM64L-G09RevD.01
frameworkgroup: C1[X(C21H19N3O6)]
method: RPBEPBE
basis: SDD
operation: Freq
keyword: #p
keyword: freq=noraman
keyword: PBEPBE/SDD
title: #p freq=noraman PBEPBE/SDD
converged: YES YES NO NO
title: Mulliken charges:
elementType: O O O O O O N N N C C C C C C C C C C C C C C C C C C C C C H H H H H H H H H H H H H H H H H H H
charge: -0.260065 -0.260528 -0.338257 -0.335472 -0.294108 -0.294457 -0.453937 -0.146261 -0.144592 0.036764 0.151743 0.215075 0.261788 0.207480 0.334368 -0.012632 -0.382949 -0.369313 -0.476310 -0.514926 0.386096 0.391782 -0.417860 -0.442541 0.318639 0.318318 -0.610033 -0.617810 -0.609264 -0.616786 0.338797 0.284095 0.265161 0.332740 0.315858 0.248921 0.253705 0.227139 0.279358 0.226920 0.226237 0.226454 0.278449 0.279648 0.229102 0.228991 0.228582 0.277914 0.227976
chargesum: 0.00000
title: Mulliken charges with hydrogens summed into heavy atoms:
elementType: O O O O O O N N N C C C C C C C C C C C C C C C C C C C C C
charge: -0.260065 -0.260528 -0.338257 -0.335472 -0.294108 -0.294457 -0.115141 -0.146261 -0.144592 0.036764 0.151743 0.215075 0.261788 0.207480 0.334368 -0.012632 -0.098854 -0.104152 -0.143570 -0.199068 0.386096 0.391782 -0.168939 -0.188836 0.318639 0.318318 0.123384 0.113330 0.128477 0.117687
polarizability: 5.79655693e+02 -3.37983999e+01 2.83247669e+02 -2.83393537e-01 3.28862243e-01 1.23191177e+02
1716.lowfreq: -4.8040 -4.0892 -0.0011 0.0012 0.0016 3.2779 8.7019 18.4146 20.4080
frequency: 4.1088 18.1275 20.3734 32.7697 42.6188 59.9872 64.9401 85.5627 86.1909 100.0216 110.7429 114.2197 117.9178 119.2941 128.5534 136.4238 141.7562 158.4271 205.6442 223.0587 228.6993 247.9686 253.4614 267.8964 278.2710 309.5830 338.1907 338.5272 364.7133 368.2490 380.0703 402.1391 404.6734 427.5655 440.9363 442.1717 465.1299 472.2144 541.3647 562.1143 599.3181 600.3099 602.9158 611.7436 624.3015 632.6721 651.7857 673.6852 673.7479 674.4545 686.8854 698.9070 738.1837 748.1905 748.7351 770.6891 776.3317 796.0370 808.6821 825.1835 836.6185 872.2257 901.0172 903.4166 914.9717 941.5223 962.7082 967.4690 989.6941 995.0005 1024.2590 1046.4304 1057.9733 1058.2610 1075.7993 1098.5056 1099.0494 1119.4079 1123.9150 1128.6708 1132.2622 1145.8244 1149.8260 1150.2030 1179.0228 1217.5173 1244.3728 1245.6694 1257.4044 1264.8802 1275.0849 1326.1400 1358.1404 1368.1953 1370.0989 1393.4799 1395.9358 1413.1332 1422.5583 1424.0047 1429.0383 1435.0262 1435.7276 1449.0166 1471.9755 1471.9864 1476.5707 1477.4298 1479.2238 1487.4183 1488.0894 1491.6046 1498.3942 1498.8792 1556.3340 1589.2969 1595.4215 1626.7916 1632.5231 1651.9515 1662.3904 1665.8800 2968.5745 2971.7186 2974.3089 2977.1801 3039.1526 3042.7657 3046.2598 3050.6777 3127.5736 3129.0772 3156.0372 3157.2315 3159.1804 3163.5347 3181.7245 3184.9837 3185.0627 3215.8881 3515.7919
redmass: 3.8878 5.4082 4.5144 5.1211 5.2899 2.1455 1.7948 1.2123 4.1812 4.1921 4.0680 2.2185 1.4800 1.7335 2.1126 5.7068 5.5748 6.0733 6.1473 5.9954 5.9085 2.8166 2.9576 5.7971 5.9970 5.9460 5.2504 6.7723 5.8801 4.3250 3.7608 6.3659 4.0375 3.6523 3.1751 5.5427 3.5311 5.8284 9.1020 7.6547 6.2824 6.3435 3.5655 4.2912 6.7481 4.0188 7.1937 7.0374 11.7429 11.1679 7.4253 2.2410 2.5943 4.1633 8.2121 8.5605 5.2555 7.9600 6.9181 1.4999 1.4882 5.5928 1.3692 1.4432 5.5614 4.4300 1.3356 1.3310 4.0585 2.8530 3.5716 7.5254 1.3735 1.3854 2.3091 1.2180 1.2187 2.7771 1.5420 2.1572 1.7467 1.6603 1.3685 1.3691 2.6994 7.0462 5.4859 3.9949 1.8190 1.6267 3.3800 3.4448 2.3671 3.1133 3.1043 3.6320 5.6780 7.1281 1.1611 1.1686 3.1580 1.2245 1.3682 3.1947 1.0491 1.0481 1.0428 1.0423 4.0951 1.0441 1.0439 3.8786 1.1870 1.1840 7.9242 7.0114 7.9976 7.9967 8.5358 6.6452 8.0914 8.0888 1.0378 1.0378 1.0375 1.0373 1.1015 1.1015 1.1019 1.1020 1.0972 1.0975 1.0947 1.0949 1.0886 1.0887 1.0971 1.0976 1.0933 1.0937 1.0768
irintensity: 4.7506 0.1417 2.4279 0.3254 2.6233 1.4690 0.0051 0.2549 0.3134 0.1235 0.1334 2.3699 0.0832 2.5115 0.1629 1.2037 1.4591 0.1610 1.9848 6.0789 2.0579 0.6492 5.3066 2.4723 0.5942 4.1903 10.6526 1.7666 1.4060 44.0296 5.5763 0.1195 0.2105 9.8572 1.6345 6.5025 14.9894 1.8277 6.0839 8.1362 4.9636 9.0315 1.3806 3.0094 0.5125 17.8307 6.9221 3.8726 11.4177 20.4755 25.9877 21.8635 37.1977 2.6617 12.5341 16.5118 8.7066 30.2537 53.2047 45.8771 40.3115 30.1689 37.1385 64.3306 52.1179 10.8627 0.1572 0.4600 13.1069 73.2307 19.2810 144.2116 35.4645 14.3203 204.5907 0.0072 0.0094 2423.5733 69.5663 130.1416 43.8533 65.2728 0.0247 0.0040 29.7579 245.7031 27.6402 60.4388 119.1204 90.9689 69.8618 112.8885 4.1481 577.7142 28.6890 75.7282 73.9169 8.4605 22.1611 36.8071 17.8385 60.0295 9.8101 6.0008 7.7918 29.2946 0.1858 0.0626 273.4057 37.0380 41.4222 13.0317 33.8530 26.2321 30.3765 41.8399 49.9719 184.0661 15.1009 388.2163 382.9846 380.7104 30.8926 30.9090 185.1047 155.5646 46.4462 43.9254 28.4859 27.0443 1.7849 1.7042 3.2916 3.2056 2.4366 6.3397 7.6817 5.2440 14.4062 21.8621 41.7689
temp: 298.150 k
press: 1.00000 atm
elementType: 8 8 8 8 8 8 7 7 7 6 6 6 6 6 6 6 6 6 6 6 6 6 6 6 6 6 6 6 6 6 1 1 1 1 1 1 1 1 1 1 1 1 1 1 1 1 1 1 1
symmnumber: 1
zpe: 969667.8 jmol-1
zpe.correction: 0.369327 hartree
zpe.thermalcorrener: 0.397376 hartree
zpe.thermalcorrenthalpy: 0.398320 hartree
zpe.thermalcorrgfe: 0.305979 hartree
zpe.sumelectzpe: -1425.152426 hartree
zpe.sumelectthermal: -1425.124377 hartree
zpe.sumelectthermalent: -1425.123433 hartree
zpe.sumelectthermalfe: -1425.215774 hartree
dipole: 1.1892 -3.9633 0.0822
dipole: 4.1387
quadrupole: -64.5279 -182.1795 -176.8178
quadrupole: -20.8405 -0.1246 -0.1162
quadrupole: 76.6472 -41.0045 -35.6427 -20.8405 -0.1246 -0.1162
hfenergy: -1425.5217525 hartree
pointgroup: C01 [X(C21H19N3O6)]
dipole: -0.5269828 1.5211713 -0.2441794 debye
polarizability: 581.7418459|-22.9948289|275.7592433|-1.5626313|-28.5101084|128.5934496 unknown
InChI: InChI=1S/C21H19N3O6/c1-23(2)20(26)28-11-5-7-13-15(9-11)22-19(25)17-14-8-6-12(29-21(27)24(3)4)10-16(14)30-18(13)17/h5-10,22H,1-4H3
charge 0 multiplicity 1
49 atoms
O  0.933367 0.917232 -0.130363
O  -0.087863 -3.64503 0.744785
O  5.872722 0.143335 -0.031634
O  -5.658714 0.992964 -0.055409
O  5.659599 2.465303 -0.491726
O  -6.572698 -1.159997 0.376705
N  -1.826895 -2.098905 0.473482
N  7.753556 1.42888 -0.291646
N  -7.934288 0.721912 0.055205
C  0.430174 -1.30603 0.296055
C  -0.091944 -0.029517 0.060972
C  1.874487 -1.189543 0.257452
C  -1.486456 0.286343 0.018769
C  2.150162 0.183072 -0.005312
C  -2.368246 -0.826467 0.24028
C  -0.446013 -2.446972 0.522446
C  2.964066 -2.079912 0.414374
C  -2.040509 1.574038 -0.217423
C  3.426966 0.74157 -0.124129
C  -3.77633 -0.647069 0.225444
C  4.489997 -0.179668 0.039986
C  -4.284775 0.643611 -0.010481
C  4.267098 -1.562137 0.303489
C  -3.426783 1.757748 -0.233284
C  6.374826 1.448812 -0.291777
C  -6.725921 0.068307 0.147795
C  8.469964 2.689607 -0.545179
C  8.580976 0.235313 -0.055841
C  -9.167797 -0.062651 0.2347
C  -8.10019 2.159668 -0.213125
H  -2.467607 -2.883523 0.629995
H  2.786527 -3.139103 0.616564
H  -1.365888 2.418594 -0.38588
H  3.602918 1.797028 -0.326868
H  -4.456985 -1.483578 0.392779
H  5.140568 -2.210336 0.417389
H  -3.871987 2.739694 -0.412405
H  9.1092 2.950315 0.319948
H  7.73656 3.492572 -0.708349
H  9.11132 2.594277 -1.442163
H  9.234423 0.392309 0.824168
H  9.22351 0.036608 -0.935503
H  7.941291 -0.636824 0.124557
H  -8.901699 -1.111756 0.42873
H  -9.794339 -0.008311 -0.675802
H  -9.751038 0.329356 1.089457
H  -8.676736 2.308718 -1.146402
H  -7.119954 2.639833 -0.316715
H  -8.652221 2.639412 0.61789
