program: Gaussian 09
title: 000010545
version: EM64L-G09RevD.01
frameworkgroup: C1[X(C10H16O2)]
method: RPBEPBE
basis: SDD
operation: Freq
keyword: #pfreq=noraman
keyword: PBEPBE/SDD
title: #p freq=noraman PBEPBE/SDD
converged: NO YES NO NO
title: Mulliken charges:
elementType: O O C C C C C C C C C C H H H H H H H H H H H H H H H H
charge: -0.201429 -0.182551 0.315565 -0.478141 0.263677 -0.452163 -0.154124 -0.240594 -0.269239 -0.779727 -0.731415 -0.717441 0.237150 0.221267 0.207893 0.239691 0.220994 0.235912 0.237365 0.234887 0.240414 0.214259 0.218152 0.221473 0.228145 0.202024 0.207401 0.260554
chargesum: 0.00000
title: Mulliken charges with hydrogens summed into heavy atoms:
elementType: O O C C C C C C C C C C
charge: -0.201429 -0.182551 0.315565 -0.019724 0.263677 -0.004578 0.066870 -0.004682 -0.031873 -0.090168 -0.063645 -0.047461
polarizability: 1.41615698e+02 6.31567309e-01 9.42381403e+01 -2.15070856e+00 -1.16895853e+00 9.46564528e+01
1716.lowfreq: -10.7282 -0.0004 -0.0004 -0.0002 5.3979 19.4152 69.4362 102.8488 152.8327
frequency: 69.3682 102.8191 152.8246 159.2273 169.6147 210.8190 238.1028 253.6600 270.7382 300.8886 347.8415 354.6690 395.7394 414.4270 439.2407 442.5713 526.8603 567.2294 624.6982 634.2615 678.6181 706.1694 772.9397 785.8743 798.3470 845.9790 887.1989 912.0134 923.4797 923.6211 941.0449 962.8580 1001.0852 1012.4763 1030.1167 1068.9360 1101.8743 1126.0659 1141.9708 1151.0185 1182.4929 1202.4932 1210.8831 1242.3065 1253.7665 1303.1578 1305.5793 1312.1859 1341.4462 1380.2414 1381.7226 1385.2199 1399.3534 1443.5589 1456.1619 1462.0272 1470.4545 1473.5624 1477.5635 1483.7496 1494.2402 1623.6217 2979.8268 2982.5411 2985.3750 2992.0624 2998.3805 3012.4363 3055.2130 3066.8743 3074.3612 3078.6157 3084.3278 3089.5441 3100.1732 3103.3344 3130.0028 3161.6910
redmass: 2.4688 2.4800 3.0085 1.1641 2.2673 1.0803 1.2495 3.0374 2.6814 2.4187 2.4536 2.7543 2.7822 2.9536 4.8780 2.8845 3.4685 4.2433 3.2431 4.0011 2.4241 3.9460 1.9309 5.3650 7.9493 1.7354 2.5362 2.0342 1.5802 1.4031 1.3942 1.4534 2.0995 2.2280 1.6865 1.9946 2.3096 1.7749 1.4929 1.8762 2.0356 1.9097 1.9652 1.7413 1.3107 1.4954 1.7565 1.5356 1.5044 1.5531 1.3979 1.2326 1.2066 1.0764 1.0761 1.0776 1.0502 1.0483 1.0500 1.0472 1.0554 7.2302 1.0368 1.0572 1.0613 1.0364 1.0573 1.0611 1.1033 1.0991 1.0986 1.1035 1.0994 1.0988 1.1002 1.0990 1.0863 1.1042
irintensity: 0.4635 0.2891 0.8368 0.4425 0.8865 0.2636 0.2488 1.2504 0.3956 0.3073 3.8830 2.0912 6.4880 3.5673 2.9152 1.9664 2.7401 0.6948 0.1744 3.4116 11.1074 16.9338 12.5983 0.1999 0.4588 19.3244 2.2620 7.2328 6.1838 4.6154 3.3635 0.3636 10.5700 5.7683 30.5273 3.9849 27.4732 4.6635 9.2156 2.9208 2.4650 1.7886 5.9227 10.8997 2.6089 3.5189 3.2073 3.5938 0.6419 27.0257 27.8651 9.1129 17.6672 2.4880 0.9176 12.3289 6.0504 1.1652 11.3195 10.9091 22.5086 0.2683 22.0830 14.5304 31.7798 11.7639 47.4953 33.9062 0.2675 7.9143 75.1747 38.9114 28.4934 24.2284 20.2500 15.8109 6.2841 19.1743
temp: 298.150 k
press: 1.00000 atm
elementType: 8 8 6 6 6 6 6 6 6 6 6 6 1 1 1 1 1 1 1 1 1 1 1 1 1 1 1 1
symmnumber: 1
zpe: 625813.4 jmol-1
zpe.correction: 0.238360 hartree
zpe.thermalcorrener: 0.250806 hartree
zpe.thermalcorrenthalpy: 0.251750 hartree
zpe.thermalcorrgfe: 0.201193 hartree
zpe.sumelectzpe: -540.062219 hartree
zpe.sumelectthermal: -540.049773 hartree
zpe.sumelectthermalent: -540.048829 hartree
zpe.sumelectthermalfe: -540.099386 hartree
dipole: 0.1786 2.6570 2.0468
dipole: 3.3587
quadrupole: -65.4826 -76.2650 -73.4324
quadrupole: -1.7317 -2.3761 -3.9852
quadrupole: 6.2441 -4.5383 -1.7057 -1.7317 -2.3761 -3.9852
hfenergy: -540.300579 hartree
pointgroup: C01 [X(C10H16O2)]
dipole: 0.0617123 1.095896 0.7357725 debye
polarizability: 141.6414199|0.6390952|94.09093|-1.8464195|-1.1336508|94.777941 unknown
InChI: InChI=1S/C10H16O2/c1-8(2)10-6-4-9(3,5-7-10)11-12-10/h4,6,8H,5,7H2,1-3H3
charge 0 multiplicity 1
28 atoms
O  0.138212 -0.983496 -0.976884
O  -1.39698 -1.085033 -0.797688
C  0.706521 0.136527 -0.099153
C  0.07572 1.449269 -0.644185
C  -1.876565 0.020643 0.140427
C  -1.478658 1.361365 -0.533975
C  2.235628 0.012988 -0.337969
C  0.227906 -0.105203 1.316271
C  -1.124924 -0.154816 1.44364
C  -3.384533 -0.221549 0.217268
C  3.006619 1.164216 0.355205
C  2.789636 -1.363538 0.103436
H  0.386556 1.56808 -1.697737
H  0.462942 2.311747 -0.074152
H  -1.890601 2.203664 0.051172
H  -1.941823 1.385134 -1.536391
H  2.385091 0.10554 -1.433292
H  0.928078 -0.280482 2.13894
H  -1.652543 -0.377763 2.376924
H  -3.844328 -0.152553 -0.783233
H  -3.599608 -1.221855 0.630771
H  -3.851402 0.53762 0.87074
H  2.834304 1.163485 1.448068
H  4.091638 1.03527 0.189965
H  2.724052 2.157018 -0.03657
H  2.734364 -1.489752 1.201143
H  3.852386 -1.454258 -0.187467
H  2.223712 -2.18617 -0.363374
