program: Gaussian 09
title: 000131059
version: EM64L-G09RevD.01
frameworkgroup: C1[X(C13H12N4)]
method: RPBEPBE
basis: SDD
operation: Freq
keyword: #pfreq=noraman
keyword: PBEPBE/SDD
title: #p freq=noraman PBEPBE/SDD
converged: YES YES NO NO
title: Mulliken charges:
elementType: N N N N C C C C C C C C C C C C C H H H H H H H H H H H H
charge: -0.052422 -0.625936 0.001304 -0.028229 0.246160 0.054705 -0.479927 0.306611 -0.403605 0.244836 -0.004500 -0.687892 -0.338683 -0.344518 -0.346202 -0.344124 -0.285581 0.224897 0.237963 0.280882 0.243971 0.219882 0.216086 0.249919 0.245338 0.242932 0.242508 0.349659 0.333967
chargesum: 0.00000
title: Mulliken charges with hydrogens summed into heavy atoms:
elementType: N N N N C C C C C C C C C C C C C
charge: -0.052422 0.057691 0.001304 -0.028229 0.246160 0.054705 -0.017068 0.306611 -0.122723 0.244836 -0.004500 -0.007953 -0.088764 -0.099180 -0.103270 -0.101617 -0.285581
polarizability: 2.54860196e+02 9.87575309e+00 1.74454200e+02 -1.36956037e+00 -1.75324339e+01 1.00970583e+02
1716.lowfreq: -0.0007 -0.0005 0.0006 5.3826 7.8389 9.8568 22.6646 51.4045 65.5242
frequency: 22.1129 51.3724 65.5154 75.7656 106.1132 127.8525 165.2820 197.6325 201.2297 258.1615 274.6584 294.6294 329.5750 370.9767 375.1938 429.1250 448.8018 472.4331 483.7465 508.1687 544.1736 567.6032 577.8074 619.2631 654.3579 662.0925 693.8986 717.1825 749.3278 772.9987 786.7823 807.6589 832.8707 886.8734 932.4120 955.5978 960.2232 966.9710 975.4538 986.3134 1027.8225 1063.3744 1068.1753 1086.4374 1110.4474 1152.2269 1186.1190 1223.0166 1255.6360 1271.9058 1285.5142 1305.0419 1330.6945 1345.1503 1352.1564 1379.1172 1398.3732 1414.0108 1453.7441 1464.7491 1471.1678 1479.4583 1489.3427 1518.8490 1540.5288 1584.0930 1592.6624 1624.3750 2157.9676 2989.2360 2993.3930 3076.2285 3085.1580 3107.8377 3129.1148 3131.1440 3152.0293 3156.5166 3159.5208 3537.9754 3689.3302
redmass: 2.7040 4.8670 4.4755 6.0745 3.7632 6.0837 3.6960 6.4309 1.3383 2.9563 5.0568 3.7779 3.9750 3.4862 3.1399 5.0787 4.1727 4.2192 1.2021 1.9817 3.8341 2.1696 4.7760 4.3149 6.1170 7.0333 6.4760 5.1870 3.4625 2.9562 4.0633 1.5718 1.5656 1.2448 1.4465 3.0032 5.5444 1.3823 1.5031 2.0330 2.4999 2.1819 1.8515 1.6341 1.8658 4.8154 2.6392 1.2573 1.2663 1.6712 3.0471 3.0939 1.6117 3.2453 2.5871 1.3671 2.0574 3.3974 2.5937 1.1112 1.0604 2.9597 1.0745 4.7802 7.1023 5.3709 4.0592 1.5648 12.6122 1.0351 1.0660 1.0944 1.1006 1.1000 1.0870 1.0889 1.0961 1.0932 1.0983 1.0448 1.1052
irintensity: 0.0211 1.0259 0.4583 2.1963 0.8948 2.8422 6.2167 0.8409 0.9061 1.9386 2.1779 3.0889 8.5820 0.1438 0.2577 2.9894 2.1466 26.0199 88.3361 114.4575 21.4941 57.2033 5.8239 18.4296 4.1734 3.1636 0.9477 4.5856 0.3137 6.5355 5.0641 7.6087 47.8787 0.0867 11.7820 4.3099 3.9632 0.5148 0.4452 2.2106 4.6944 6.2931 9.4268 0.3264 2.4969 0.4217 4.9406 4.0659 8.5937 13.3911 12.6216 12.3003 1.0482 1.2181 29.3383 19.1068 21.1875 20.2459 95.2838 13.7811 15.1501 32.5706 18.4332 120.0162 41.3412 110.6682 102.4062 441.8083 89.9847 39.8342 12.3898 10.5527 32.7518 30.7453 11.6468 15.7508 29.7528 5.1278 2.7609 134.4580 42.4531
temp: 298.150 k
press: 1.00000 atm
elementType: 7 7 7 7 6 6 6 6 6 6 6 6 6 6 6 6 6 1 1 1 1 1 1 1 1 1 1 1 1
symmnumber: 1
zpe: 590643.3 jmol-1
zpe.correction: 0.224964 hartree
zpe.thermalcorrener: 0.240151 hartree
zpe.thermalcorrenthalpy: 0.241095 hartree
zpe.thermalcorrgfe: 0.181406 hartree
zpe.sumelectzpe: -720.399848 hartree
zpe.sumelectthermal: -720.384662 hartree
zpe.sumelectthermalent: -720.383717 hartree
zpe.sumelectthermalfe: -720.443407 hartree
dipole: -1.3174 3.3684 -0.2152
dipole: 3.6233
quadrupole: -112.2217 -105.7436 -96.7667
quadrupole: -10.1966 1.1263 -4.1984
quadrupole: -7.3110 -0.8329 8.1440 -10.1966 1.1263 -4.1984
hfenergy: -720.6248125 hartree
pointgroup: C01 [X(C13H12N4)]
dipole: -0.3666854 -1.34136 0.3135925 debye
polarizability: 254.8001664|3.4853659|164.5123954|13.88771|-29.0195458|110.9724176 unknown
InChI: InChI=1S/C13H12N4/c1-2-12-11(9-3-5-16-6-4-9)7-10(8-14)13(15)17-12/h3-7H,2,15H2,1H3
charge 0 multiplicity 1
29 atoms
N  -1.541296 -1.638466 0.329405
N  -3.816513 -1.152699 0.148865
N  4.316158 1.490301 0.001551
N  -4.143706 2.279351 -0.920112
C  0.193175 0.052956 -0.029292
C  -0.224139 -1.285817 0.285627
C  0.740501 -2.436811 0.531246
C  1.611927 0.508833 -0.022719
C  -0.821038 0.985593 -0.361473
C  -2.186241 0.625635 -0.338383
C  -2.513907 -0.725028 0.048589
C  0.498891 -3.615575 -0.446262
C  2.479124 0.276659 1.080109
C  2.143956 1.25637 -1.108616
C  3.798879 0.776344 1.046926
C  3.477329 1.717903 -1.053654
C  -3.229015 1.549195 -0.660854
H  0.593013 -2.799583 1.567541
H  1.78313 -2.092012 0.445871
H  -0.549639 2.014958 -0.616126
H  -0.545757 -3.960972 -0.376119
H  1.170476 -4.458321 -0.203464
H  0.694577 -3.311155 -1.490432
H  2.123154 -0.257785 1.966816
H  1.53433 1.458802 -1.99599
H  4.477964 0.610718 1.890938
H  3.90372 2.290674 -1.88503
H  -4.599254 -0.530194 -0.040649
H  -3.982799 -2.119972 0.41849
