program: Gaussian 09
title: 000131032
version: EM64L-G09RevD.01
frameworkgroup: C1[X(C13H26N4O2)]
method: RPBEPBE
basis: SDD
operation: Freq
keyword: #p
keyword: freq=noraman
keyword: PBEPBE/SDD
title: #p freq=noraman PBEPBE/SDD
converged: YES YES NO NO
title: Mulliken charges:
elementType: O O N N N N C C C C C C C C C C C C C H H H H H H H H H H H H H H H H H H H H H H H H H H
charge: -0.260759 -0.274194 -0.333338 -0.349239 -0.376819 -0.601223 -0.102150 -0.450814 -0.455260 -0.426763 -0.405924 -0.132555 -0.454075 -0.001672 0.182356 -0.714294 -0.723746 -0.425020 0.206096 0.211482 0.281715 0.205020 0.215015 0.222334 0.186212 0.226104 0.207299 0.199215 0.248264 0.196391 0.251578 0.239609 0.194243 0.183767 0.219674 0.214531 0.207066 0.208894 0.226987 0.214418 0.342776 0.261562 0.261871 0.328216 0.345152
chargesum: 0.00000
title: Mulliken charges with hydrogens summed into heavy atoms:
elementType: O O N N N N C C C C C C C C C C C C C
charge: -0.260759 -0.274194 -0.085075 -0.097661 -0.034043 0.072146 0.109332 0.035921 -0.017912 -0.014447 0.000590 0.063837 -0.020222 0.182095 0.182356 -0.073024 -0.073447 0.098413 0.206096
polarizability: 1.86453084e+02 -9.23621548e-01 1.87457496e+02 -5.28363753e+00 8.23553189e+00 1.48139062e+02
1716.lowfreq: -21.7984 -12.4664 -4.7211 -0.0002 0.0003 0.0005 6.1871 13.5042 30.4224
frequency: -13.0387 10.9770 30.0133 34.8602 38.5731 43.3029 61.9056 73.4077 89.5039 95.8780 120.6240 134.3335 181.1175 190.8239 203.7063 225.0670 226.1071 237.5650 265.4721 269.1281 296.5493 328.8122 351.9790 388.9696 412.6531 427.0260 448.0175 463.5920 473.3146 517.0763 535.4794 550.1558 589.8815 600.7406 629.6885 664.4223 700.7204 725.9817 739.7146 808.0796 817.4361 835.5747 854.2345 866.6618 888.7157 913.3586 913.5000 929.9433 938.7181 948.0658 961.2315 974.1301 986.6073 990.2892 1024.2190 1054.2778 1061.0072 1074.1114 1103.4886 1117.0048 1120.1230 1127.8580 1147.2106 1157.7675 1174.5670 1182.7188 1199.6755 1201.8446 1205.8076 1213.3189 1220.6058 1237.1109 1270.4435 1273.2290 1282.6938 1293.5533 1297.4359 1305.3457 1315.2569 1328.3478 1334.3181 1344.7103 1350.0634 1365.8966 1378.4892 1380.5953 1396.5240 1407.5123 1448.4950 1452.7801 1465.3864 1468.2871 1468.6655 1469.1947 1471.1144 1475.6301 1480.1631 1481.8668 1488.9371 1499.8029 1594.4989 1610.1828 1653.4260 2804.1294 2835.1999 2937.0815 2949.6389 2950.9496 2967.2398 2969.6070 2970.0746 2978.2221 2994.6116 3006.8771 3008.5491 3012.3606 3025.1937 3042.0362 3059.6284 3067.1600 3067.7871 3070.1590 3072.2708 3090.4702 3468.7527 3485.7728 3517.6539 3519.7779 3672.0932
redmass: 3.6156 5.8024 3.7006 3.0603 4.5163 3.0040 5.5873 2.7294 4.5657 3.2707 2.9782 2.4542 2.9555 1.0712 1.8709 1.5793 2.4345 3.3291 4.6045 2.1862 4.4913 1.9342 2.2135 2.1901 2.1562 2.5498 1.9970 2.1512 1.4718 2.7121 1.2658 3.1661 5.1703 1.9090 1.4184 1.4780 2.7566 3.6960 2.8822 3.1456 2.2790 2.3624 1.9752 1.7693 1.6983 1.2810 2.2021 2.5520 2.4614 1.6559 1.8701 1.7056 2.0832 2.2370 1.6688 2.6547 2.4281 1.6192 2.3655 2.1214 2.3291 2.3376 2.6276 1.8844 1.8245 1.6010 1.1099 2.2049 1.6151 1.3863 1.3371 1.3099 1.2881 1.2685 1.5801 1.3545 1.2614 1.2620 1.2557 1.3909 1.3894 1.3962 1.4534 1.3915 1.4401 2.2679 1.2160 1.3945 1.1767 1.2259 1.3852 1.0933 1.0865 1.1341 1.2204 1.1867 1.0568 1.0981 1.0515 1.0872 1.9187 3.0739 3.7417 1.0790 1.0717 1.0827 1.0825 1.0643 1.0355 1.0568 1.0394 1.0585 1.0852 1.0644 1.1011 1.0785 1.0867 1.1017 1.0995 1.0995 1.0992 1.1015 1.0991 1.1033 1.0774 1.0762 1.0748 1.0450 1.1046
irintensity: 0.0365 0.1569 0.2195 0.5130 2.9875 0.7962 12.9741 3.2930 6.4026 3.7572 11.0281 3.1083 2.3385 0.1277 2.3226 1.4500 10.7628 2.6895 2.6206 9.1004 2.8433 44.9485 16.0837 13.8567 24.4475 28.8840 24.5002 68.8365 13.0941 34.7013 208.4964 4.6101 6.3011 19.8042 48.5033 128.1781 12.2903 26.6805 1.2138 2.1940 1.1269 0.3832 11.1307 1.5800 6.0545 4.8475 3.0375 11.9277 8.1168 0.2597 4.1784 11.4610 1.4816 1.6604 4.9305 10.3577 6.3977 0.4540 8.4423 23.1230 2.4758 7.3286 6.0063 69.2512 14.8617 28.8541 0.5015 30.4200 2.3839 10.9325 2.9659 1.1141 4.8649 7.4042 15.9049 4.6297 1.7453 3.0509 2.7309 13.3949 51.8635 20.8393 33.1647 64.0950 62.0038 162.7208 17.7607 28.7527 31.2348 28.8787 109.5061 14.4584 45.5907 40.5369 50.6765 77.8752 5.8080 18.6591 15.4973 1.4687 160.0158 107.8799 236.2136 103.4928 138.3515 97.4107 28.9987 94.4770 36.9277 44.6164 14.9798 33.0069 18.2464 55.1908 16.3113 33.2179 43.1417 19.0606 9.5637 45.1609 64.4628 60.6739 69.7657 21.7566 90.5417 0.4007 1.1524 47.7196 32.5214
temp: 298.150 k
press: 1.00000 atm
elementType: 8 8 7 7 7 7 6 6 6 6 6 6 6 6 6 6 6 6 6 1 1 1 1 1 1 1 1 1 1 1 1 1 1 1 1 1 1 1 1 1 1 1 1 1 1
symmnumber: 1
zpe: 1022942.0 jmol-1
zpe.correction: 0.389618 hartree
zpe.thermalcorrener: 0.411245 hartree
zpe.thermalcorrenthalpy: 0.412189 hartree
zpe.thermalcorrgfe: 0.335699 hartree
zpe.sumelectzpe: -878.914061 hartree
zpe.sumelectthermal: -878.892435 hartree
zpe.sumelectthermalent: -878.891490 hartree
zpe.sumelectthermalfe: -878.967981 hartree
dipole: -4.2612 -1.9673 0.1133
dipole: 4.6948
quadrupole: -118.1200 -92.9997 -122.2143
quadrupole: 17.4671 9.8937 3.0098
quadrupole: -7.0087 18.1117 -11.1030 17.4671 9.8937 3.0098
hfenergy: -879.3036792 hartree
pointgroup: C01 [X(C13H26N4O2)]
dipole: 1.6184503 -0.888772 -0.0484152 debye
polarizability: 185.6292704|-0.5327168|184.9443987|-8.2903564|-12.2020535|151.4759729 unknown
InChI: InChI=1S/C13H26N4O2/c1-9(2)6-11(13(19)17-8-12(14)18)16-7-10-4-3-5-15-10/h9-11,15-17H,3-8,14H2,1-2H3
charge 0 multiplicity 1
45 atoms
O  0.26354 -0.616959 1.528196
O  4.047069 -1.821038 -1.362701
N  -4.377771 -0.604015 -0.808489
N  -1.09924 1.246275 -0.208427
N  1.899645 -0.82352 -0.092168
N  4.41838 -3.500919 0.199714
C  -3.403417 0.301045 -0.138835
C  -3.388002 -0.188976 1.332611
C  -3.637345 -1.715012 1.209412
C  -1.989016 0.232193 -0.783387
C  -4.637868 -1.815821 0.02668
C  0.343182 1.074306 -0.314535
C  1.086465 2.300072 0.292291
C  0.827876 3.662998 -0.408422
C  0.802483 -0.193435 0.459613
C  1.598816 4.777807 0.339637
C  1.215214 3.640969 -1.906015
C  2.515875 -1.974545 0.552307
C  3.723111 -2.416818 -0.291575
H  -3.751478 1.355022 -0.195237
H  -2.425949 0.056193 1.812175
H  -4.20844 0.289088 1.899719
H  -2.688695 -2.230722 0.970757
H  -4.035825 -2.15587 2.139676
H  -2.096355 0.319824 -1.896393
H  -1.558307 -0.766286 -0.578946
H  -5.68063 -1.807124 0.405408
H  -4.506113 -2.749827 -0.555228
H  -4.180545 -0.787186 -1.798073
H  0.691484 0.94411 -1.374497
H  -1.420548 2.210362 -0.325081
H  0.79306 2.373302 1.357648
H  2.176467 2.099072 0.262046
H  -0.253804 3.907677 -0.334196
H  1.309272 4.820751 1.406034
H  1.401315 5.769145 -0.108537
H  2.69014 4.596627 0.291771
H  2.283797 3.377518 -2.028476
H  0.617283 2.909729 -2.479853
H  1.058064 4.63405 -2.366319
H  2.336385 -0.518731 -0.970688
H  1.789321 -2.806746 0.648584
H  2.835525 -1.722804 1.583687
H  4.149567 -3.971659 1.06235
H  5.227711 -3.839323 -0.320139
