program: Gaussian 09
title: 000131000
version: EM64L-G09RevD.01
frameworkgroup: C1[X(C11H20O4)]
method: RPBEPBE
basis: SDD
operation: Freq
keyword: #pfreq=noraman
keyword: PBEPBE/SDD
title: #p freq=noraman PBEPBE/SDD
converged: YES YES NO NO
title: Mulliken charges:
elementType: O O O O C C C C C C C C C C C H H H H H H H H H H H H H H H H H H H H
charge: -0.190583 -0.464238 -0.428904 -0.240027 -0.334298 -0.161090 -0.075247 -0.331047 -0.408182 0.214816 -0.398807 -0.374498 -0.355481 -0.357737 -0.696664 0.280961 0.243724 0.195734 0.244175 0.242064 0.210896 0.190173 0.233765 0.223969 0.244750 0.179672 0.192623 0.178248 0.369211 0.201966 0.194682 0.340005 0.210760 0.207264 0.217347
chargesum: 0.00000
title: Mulliken charges with hydrogens summed into heavy atoms:
elementType: O O O O C C C C C C C C C C C
charge: -0.190583 -0.095027 -0.088899 -0.240027 -0.053336 0.082633 0.120487 0.155191 -0.007112 0.214816 0.058927 0.049924 0.015389 0.038911 -0.061294
polarizability: 1.54683015e+02 -3.43921340e+00 1.34980373e+02 3.13868840e+00 -3.45205232e+00 1.00948236e+02
1716.lowfreq: -5.2053 -0.0004 0.0002 0.0005 7.2760 9.6574 30.2302 44.8311 54.8410
frequency: 30.0008 44.7941 54.7146 65.8626 82.6231 95.0475 121.9565 130.0509 152.6258 156.5169 186.2818 199.3210 229.1289 248.4817 289.2052 311.4584 321.7578 371.6208 393.4829 436.4351 447.7873 498.1351 540.0593 594.4000 632.1383 649.8450 671.1201 723.5673 752.9560 821.8908 839.4273 877.0198 889.6844 907.7982 914.7422 953.3348 957.6284 981.3921 997.7810 1036.3760 1044.5725 1059.2976 1067.6050 1078.9152 1081.4939 1098.6491 1107.9298 1120.6786 1137.3411 1152.0377 1178.1469 1197.8175 1212.7871 1241.3239 1246.0615 1257.0317 1284.2711 1288.1249 1291.0140 1299.9321 1307.7283 1320.1678 1323.6458 1330.6720 1347.4821 1353.6173 1358.0113 1369.4989 1388.4456 1405.1760 1446.5219 1464.4819 1470.0068 1470.5089 1476.8317 1480.6102 1484.2148 1488.4961 1661.9400 2910.3557 2948.0731 2962.4783 2966.7274 2970.5704 2971.9406 2975.6269 2986.4906 2990.9550 2992.9938 3021.4250 3024.7722 3037.6763 3059.9025 3068.5587 3071.6742 3071.9915 3127.9451 3414.7169 3567.7362
redmass: 3.0844 3.6492 2.0961 3.7131 4.0612 3.4220 2.4870 2.2232 3.3717 3.8487 3.6318 4.3326 1.1338 4.1608 1.6092 1.7036 5.9782 3.8972 4.5824 3.4660 2.6677 3.0255 3.7721 1.1199 3.5234 5.5945 6.3213 1.0730 1.1751 1.4623 5.1483 2.3970 1.8647 1.7524 1.4691 6.5326 4.2203 1.6020 3.9946 3.5076 2.9190 1.9112 2.6480 2.2257 2.2727 2.6767 1.5555 2.5814 3.0763 1.2624 1.3153 1.5344 1.3712 1.3703 1.3151 1.2681 1.1124 1.1224 1.1742 1.2400 1.1893 1.3700 1.2059 1.2820 1.4412 1.4204 1.6367 1.2472 1.2187 1.6241 1.0864 1.0686 1.0730 1.0780 1.0430 1.0712 1.0859 1.0895 11.3181 1.0829 1.0592 1.0626 1.0610 1.0603 1.0391 1.0827 1.0822 1.0646 1.0948 1.0964 1.1029 1.0628 1.1001 1.1006 1.0993 1.1022 1.1058 1.0658 1.0665
irintensity: 0.7988 0.0877 0.4280 1.3502 1.7789 4.7418 1.1340 1.5746 0.6790 7.2850 2.2551 7.9888 0.0180 2.6879 78.7325 65.0489 15.1118 3.8561 7.6312 3.6024 4.6312 16.6355 7.2978 148.1618 40.3818 8.6994 7.9797 9.1547 2.9080 4.1092 4.0684 7.0280 8.3283 26.8096 30.2250 10.3208 119.5601 3.2069 7.1002 25.8180 33.8135 25.1506 27.3364 19.1538 10.7556 27.3837 26.4150 52.7605 131.6692 8.4794 20.2676 1.0550 22.2608 10.5171 0.7866 7.8972 14.2434 23.7206 0.5454 2.4558 14.2837 2.2800 11.8981 2.0919 6.0698 19.0072 1.5109 11.3869 11.2938 71.8849 2.0729 0.0596 1.0852 5.5629 12.4986 2.5740 6.8444 20.0212 260.0397 39.9862 14.2842 8.3202 13.5601 113.3694 27.7167 3.0083 16.9327 41.2240 18.1582 43.1573 1.3097 30.4029 22.7112 112.7682 60.7311 26.4165 16.5454 79.1018 9.5110
temp: 298.150 k
press: 1.00000 atm
elementType: 8 8 8 8 6 6 6 6 6 6 6 6 6 6 6 1 1 1 1 1 1 1 1 1 1 1 1 1 1 1 1 1 1 1 1
symmnumber: 1
zpe: 784416.2 jmol-1
zpe.correction: 0.298768 hartree
zpe.thermalcorrener: 0.315957 hartree
zpe.thermalcorrenthalpy: 0.316902 hartree
zpe.thermalcorrgfe: 0.252438 hartree
zpe.sumelectzpe: -730.835751 hartree
zpe.sumelectthermal: -730.818562 hartree
zpe.sumelectthermalent: -730.817618 hartree
zpe.sumelectthermalfe: -730.882082 hartree
dipole: 1.6008 4.3076 -1.2134
dipole: 4.7529
quadrupole: -103.6829 -105.9688 -88.7047
quadrupole: -5.5843 -1.1462 -4.0144
quadrupole: -4.2308 -6.5167 10.7475 -5.5843 -1.1462 -4.0144
hfenergy: -731.1345198 hartree
pointgroup: C01 [X(C11H20O4)]
dipole: -0.5459121 1.7518938 0.3599623 debye
polarizability: 154.548875|2.3186555|134.8841884|6.0010964|1.6272967|101.1785602 unknown
InChI: InChI=1S/C11H20O4/c1-2-3-4-5-9(13)10-8(6-12)7-15-11(10)14/h8-10,12-13H,2-7H2,1H3
charge 0 multiplicity 1
35 atoms
O  3.476429 -0.900937 0.810389
O  -0.418242 -2.206805 -0.517115
O  2.36534 3.249776 -0.096615
O  2.230663 -2.775136 0.271105
C  1.33888 -0.495952 -0.244304
C  1.847236 0.853528 0.328599
C  -0.104176 -0.943016 0.15271
C  3.343123 0.582857 0.657581
C  -1.192825 0.060263 -0.258064
C  2.355106 -1.53153 0.26911
C  1.708021 2.047041 -0.63417
C  -2.607618 -0.400462 0.156166
C  -3.709915 0.59463 -0.268716
C  -5.12714 0.139142 0.148795
C  -6.230274 1.13119 -0.278348
H  1.382574 -0.500734 -1.353735
H  1.303403 1.074567 1.270257
H  -0.128934 -1.079226 1.260326
H  4.010902 0.896048 -0.163473
H  3.688766 1.026096 1.601745
H  -1.152575 0.193519 -1.35826
H  -0.979875 1.044855 0.206454
H  0.645556 2.246713 -0.875863
H  2.246288 1.839126 -1.575496
H  -2.797194 -1.393725 -0.290016
H  -2.640756 -0.537496 1.257829
H  -3.680923 0.728486 -1.370545
H  -3.504737 1.593827 0.172052
H  0.313309 -2.854016 -0.305401
H  -5.331084 -0.857313 -0.292513
H  -5.155664 0.002686 1.249257
H  1.834529 3.601774 0.661825
H  -6.244208 1.259206 -1.377315
H  -6.064245 2.128041 0.172698
H  -7.231941 0.782379 0.033353
