program: Gaussian 09
title: 000010535
version: EM64L-G09RevD.01
frameworkgroup: C1[X(C6H12BrNO)]
method: RPBEPBE
basis: SDD
operation: Freq
keyword: #p
keyword: freq=noraman
keyword: PBEPBE/SDD
title: #p freq=noraman PBEPBE/SDD
converged: YES YES NO NO
title: Mulliken charges:
elementType: Br O N C C C C C C H H H H H H H H H H H H
charge: -0.080229 -0.262850 -0.597351 -0.207814 -0.356789 -0.393365 0.259522 -0.694555 -0.693195 0.231204 0.246923 0.243843 0.261429 0.224350 0.217461 0.255155 0.223092 0.218316 0.239501 0.335080 0.330272
chargesum: 0.00000
title: Mulliken charges with hydrogens summed into heavy atoms:
elementType: Br O N C C C C C C
charge: -0.080229 -0.262850 0.068001 -0.207814 0.121337 0.111907 0.259522 0.002411 -0.012286
polarizability: 1.12049964e+02 -3.26876967e+00 9.14657311e+01 5.15001621e+00 -2.33864728e+00 7.31453618e+01
1716.lowfreq: -15.9119 -8.1955 -0.0004 -0.0003 0.0004 10.7603 32.9301 107.9257 116.8177
frequency: 32.4577 107.9242 116.8077 150.6199 185.2800 198.0482 208.5606 238.9354 267.9137 297.0545 301.9388 365.0905 382.1667 530.8324 578.0903 589.3671 614.2598 707.8397 726.4116 790.5119 809.9419 908.8602 931.6331 1018.1308 1038.8895 1063.8222 1075.2303 1100.6240 1148.9174 1176.3596 1260.4959 1272.5419 1308.9132 1340.0051 1356.9726 1390.2325 1395.9626 1453.8409 1467.8803 1472.1730 1482.4430 1485.3634 1492.5101 1562.5748 1624.3416 2986.3266 2992.9751 3001.3115 3010.2290 3050.6863 3063.3981 3080.5238 3086.0719 3088.1447 3103.1002 3495.1500 3652.0183
redmass: 5.3718 2.3950 1.9415 3.7739 2.1056 2.9497 1.2187 2.8794 5.3306 1.9361 2.2437 3.7852 3.3494 2.4358 1.6780 1.2565 1.7053 2.1589 3.5678 1.3611 1.5097 2.2294 1.8088 2.1118 1.9852 1.9122 2.0810 1.8156 2.0284 3.0676 1.1842 1.2359 1.3702 1.6610 2.4936 1.2083 1.1945 1.0649 1.0704 1.0506 1.0489 1.0436 1.0662 1.7646 2.6037 1.0360 1.0356 1.0606 1.0607 1.0994 1.1014 1.0990 1.0998 1.1000 1.1007 1.0454 1.1039
irintensity: 11.4060 0.4410 0.6934 0.3319 3.7613 2.4405 1.2960 6.1603 13.0137 0.4924 0.3686 2.2454 5.8359 6.2095 15.1751 129.3151 119.0947 15.1307 34.1346 12.0956 58.0863 6.9161 15.2925 4.8805 3.7302 3.4796 1.7212 36.0380 6.8961 2.1662 4.0231 16.9387 16.6214 32.5733 54.4132 16.6987 18.2139 8.6877 27.1094 15.2774 13.3806 1.9328 2.8504 76.3622 261.5719 27.7269 27.5053 6.8306 11.4570 2.3953 6.3336 54.8485 24.4783 23.8378 27.0994 29.9788 59.4820
temp: 298.150 k
press: 1.00000 atm
elementType: 35 8 7 6 6 6 6 6 6 1 1 1 1 1 1 1 1 1 1 1 1
symmnumber: 1
zpe: 458401.3 jmol-1
zpe.correction: 0.174596 hartree
zpe.thermalcorrener: 0.185996 hartree
zpe.thermalcorrenthalpy: 0.186940 hartree
zpe.thermalcorrgfe: 0.136740 hartree
zpe.sumelectzpe: -378.562038 hartree
zpe.sumelectthermal: -378.550638 hartree
zpe.sumelectthermalent: -378.549694 hartree
zpe.sumelectthermalfe: -378.599894 hartree
dipole: 0.3902 -0.4196 1.5416
dipole: 1.6447
quadrupole: -73.2458 -55.6960 -66.2604
quadrupole: -4.9992 -4.3705 -2.8024
quadrupole: -8.1783 9.3714 -1.1930 -4.9992 -4.3705 -2.8024
hfenergy: -378.7366337 hartree
pointgroup: C01 [X(C6H12Br1N1O1)]
dipole: 0.1244493 0.2574089 -0.5804797 debye
dipolederiv: -0.2657572 -0.0030594 -0.0080343 -0.025937 -0.5305668 -0.3161568 0.0008633 -0.3035444 -0.5273492 -0.671556 -0.1198031 -0.2574508 0.0759174 -0.4098177 -0.1881999 0.0931916 -0.2153929 -0.9097491 -0.8882518 0.1398682 0.3734559 0.0860047 -0.5781532 0.0594843 0.2666319 0.0244569 -0.5972292 -0.0220251 -0.0319287 -0.1014253 0.0494656 0.7142355 0.4881088 -0.1007369 0.4546856 0.6440768 0.0263082 0.0012368 -0.0283081 -0.0328634 -0.0546914 -0.050102 0.0187269 -0.1572883 -0.054209 0.043798 -0.0385594 -0.0593366 0.0351592 -0.0342179 -0.132227 0.0342024 -0.0444109 -0.1431288 1.1996288 0.0143115 0.022142 -0.2284394 0.1554869 0.2498606 -0.3234941 0.278487 0.9740512 0.0633326 0.0355542 -0.0111877 0.018185 -0.0502586 -0.0779069 -0.0345536 0.0657064 0.0614347 -0.0877969 -0.03031 -0.0204818 -0.0162854 0.0918536 0.0172291 0.0323664 0.0046992 0.0542291 -0.0118567 -0.0300185 0.1285273 -0.0176193 0.0266373 0.0064859 0.0965958 0.0327453 -0.0363746 -0.0714702 -0.0076873 -0.0953593 0.0040656 0.0345123 -0.0307365 -0.0895274 -0.0260405 0.0535918 0.0114485 0.0592635 -0.0037002 0.0474666 -0.0837196 0.0909361 -0.0240729 0.0567773 0.0775811 0.0486926 -0.0099592 0.0147206 -0.0381673 0.0529373 -0.0740579 -0.0104245 -0.1019467 -0.0089813 -0.0376623 -0.0136295 0.1144004 -0.0467687 0.0923695 0.0297625 0.1199366 -0.0078875 -0.0373921 0.084898 0.0643795 -0.0197603 0.0579245 -0.1487351 0.0684211 -0.0267065 0.097808 0.0161263 -0.0547522 -0.0593086 -0.074584 -0.0194044 0.118784 -0.0035521 -0.0614103 -0.0502317 0.0402535 -0.0226539 -0.0435173 0.0982259 -0.0630397 0.0667189 0.0712678 0.1368605 0.0788986 -0.0591433 0.0554599 0.0590738 -0.0327721 0.1050159 -0.1318101 0.0424328 -0.0440921 0.0507832 0.0724063 0.085983 0.0085275 -0.0105947 -0.0291702 0.0191809 -0.0938923 -0.0831 -0.1034577 -0.0304555 0.1877618 -0.0108488 -0.0269849 -0.0061628 0.3353196 -0.0827044 -0.02296 -0.07874 0.1926629 0.3264706 0.0164147 -0.0014919 0.044653 0.3139344 -0.0744532 0.021703 -0.0561069 0.2175982 unknown
polarizability: 90.8462277|0.8890295|91.4179101|-2.5148124|20.2668807|94.3969189 unknown
InChI: InChI=1S/C6H12BrNO/c1-3-6(7,4-2)5(8)9/h3-4,8H2,1-2H3
charge 0 multiplicity 1
21 atoms
Br -0.201748 -1.585015 -1.780792
O  1.482257 0.448444 1.47291
N  2.357465 -0.323955 -0.529706
C  -0.140292 -0.119331 -0.255356
C  -0.537439 1.206696 -0.963561
C  -1.105462 -0.592681 0.852653
C  1.309014 -0.010104 0.30126
C  -0.617533 2.41984 -0.002969
C  -2.600295 -0.607093 0.483591
H  0.196086 1.414547 -1.764348
H  -1.513897 1.05574 -1.456924
H  -0.788003 -1.598206 1.184795
H  -0.927589 0.080105 1.713814
H  -1.406502 2.285963 0.757903
H  -0.858004 3.328244 -0.584173
H  0.334966 2.586004 0.527407
H  -3.188017 -0.996878 1.334067
H  -2.982279 0.40379 0.253525
H  -2.794483 -1.256796 -0.388084
H  3.305668 -0.19178 -0.177872
H  2.201887 -0.776533 -1.431039
