program: Gaussian 09
title: 000130972
version: EM64L-G09RevD.01
frameworkgroup: C1[X(C13H25N9O3)]
method: RPBEPBE
basis: SDD
operation: Freq
keyword: #p
keyword: freq=noraman
keyword: PBEPBE/SDD
title: #p freq=noraman PBEPBE/SDD
converged: NO YES NO NO
title: Mulliken charges:
elementType: O O O N N N N N N N N N C C C C C C C C C C C C C H H H H H H H H H H H H H H H H H H H H H H H H H
charge: -0.277268 -0.277190 -0.301022 -0.119623 -0.370442 -0.267921 -0.116283 -0.312179 -0.658880 -0.634163 -0.171400 -0.606089 -0.046583 -0.546608 -0.112110 -0.348275 0.178700 0.144652 -0.402808 -0.456403 -0.692743 -0.458703 0.215495 -0.088612 0.190251 0.229101 0.254241 0.219087 0.221042 0.177191 0.247883 0.321343 0.195900 0.193663 0.242193 0.266519 0.218830 0.266372 0.331636 0.204373 0.194554 0.276381 0.294995 0.256338 0.311942 0.336609 0.294650 0.319104 0.328062 0.334197
chargesum: 0.00000
title: Mulliken charges with hydrogens summed into heavy atoms:
elementType: O O O N N N N N N N N N C C C C C C C C C C C C C
charge: -0.277268 -0.277190 -0.301022 -0.119623 -0.049099 0.008461 -0.116283 -0.017184 -0.010328 -0.020409 -0.171400 0.056170 0.182517 -0.073280 0.108932 0.076800 0.178700 0.144652 -0.013245 0.052309 0.124096 -0.059775 0.215495 0.167726 0.190251
polarizability: 2.96924925e+02 -9.28928638e+00 2.25770037e+02 -1.33538670e+01 -5.33295524e+00 1.47115827e+02
1716.lowfreq: -15.6815 -6.7464 -5.2367 -0.0007 0.0007 0.0013 6.6774 9.8391 13.8590
frequency: -2.4014 9.3131 12.9019 27.6282 31.3520 37.0089 43.2440 69.8645 81.7452 91.7092 104.4886 112.4496 139.3439 149.0557 157.1573 167.1782 172.5378 187.8036 225.1039 235.2641 251.2428 266.4049 279.0012 307.4068 317.1993 322.4298 341.6746 365.5124 370.0649 391.5099 395.4556 410.2703 419.1460 435.7009 447.7782 461.7540 490.2633 501.2537 508.5429 530.0276 536.3718 549.1740 566.8609 577.9309 583.4883 596.3664 602.2573 628.4505 655.5567 674.6265 697.7613 709.0594 728.1538 731.9508 757.7226 768.0037 828.0420 859.4777 891.3166 903.2469 930.9654 933.9625 956.3074 974.3197 997.2646 1004.7901 1019.0337 1029.7151 1031.8251 1041.1351 1052.2908 1071.6964 1082.8536 1098.1750 1111.3694 1123.0919 1129.4510 1137.3470 1165.3836 1179.1716 1186.2719 1206.2196 1223.8033 1232.5690 1258.8114 1267.7196 1269.9386 1286.9853 1302.7043 1316.6742 1322.6507 1327.2096 1330.3698 1349.2296 1355.4674 1358.6779 1363.6635 1388.4999 1396.8902 1412.0983 1428.4169 1429.3832 1434.4024 1450.4514 1458.9638 1463.6267 1476.7926 1477.8077 1491.6801 1517.1230 1525.2959 1562.9014 1598.3915 1600.6846 1607.3411 1615.3154 1631.8294 1641.7281 1669.5785 2872.6623 2916.8325 2946.6660 2949.9157 2964.2764 2966.5726 2969.4133 2975.5002 3005.6348 3013.8695 3024.6394 3057.0524 3058.7800 3085.0381 3090.9966 3107.0274 3414.6304 3458.2086 3490.4821 3528.5091 3543.3948 3551.5665 3677.4109 3696.8308 3707.1320
redmass: 5.2522 5.4764 5.4806 4.1262 6.6886 5.8903 6.0475 5.3471 4.5240 4.6184 4.0465 3.3982 4.3179 2.9862 4.5703 4.4100 4.2294 3.3982 3.5091 1.4137 2.5293 2.2926 2.5671 3.5913 4.7224 3.8318 2.3837 2.2711 2.1600 2.5332 2.4077 1.4471 1.1925 2.9812 2.8946 1.9588 2.9116 2.6217 2.3645 2.3849 1.4263 1.4145 2.3621 3.1495 1.6358 1.1254 2.5851 3.1173 3.3980 5.6427 1.6211 3.8636 10.1596 3.8013 3.1245 1.5407 3.7807 2.7475 2.2253 3.1783 2.6721 3.0023 2.9373 2.4978 2.1515 1.4989 3.1902 1.4544 2.2557 2.0890 1.9776 2.6543 2.1870 3.5005 2.2623 2.4362 1.4081 2.2673 1.5279 2.0638 1.3927 1.4443 1.3466 2.0494 2.5606 1.5114 1.2999 1.2474 1.2703 1.4345 1.4660 1.6016 1.3537 1.3805 1.5801 2.6848 1.4782 2.2250 2.0696 4.3144 1.7210 1.3108 1.2359 1.0840 1.0894 1.0953 1.0897 1.0900 1.0776 1.0617 1.4662 1.5419 6.9285 1.2517 4.3157 1.2843 3.4213 5.8686 3.5749 1.0548 1.1012 1.0837 1.0721 1.0749 1.0415 1.0603 1.0634 1.0654 1.0881 1.0984 1.1007 1.1024 1.0907 1.0965 1.0986 1.0772 1.0761 1.0740 1.0450 1.0442 1.0455 1.1021 1.1028 1.1056
irintensity: 0.4740 0.1215 0.2245 2.2898 0.9084 6.3945 3.8784 0.8260 3.1090 3.2122 1.7856 1.5386 12.5636 0.5764 9.3850 21.5681 9.0775 4.9548 3.3755 2.1953 1.1866 7.1771 19.7647 3.6398 10.2764 2.2946 20.5388 60.8266 33.1747 22.6191 54.8514 183.7573 94.8760 1.5625 9.8173 24.6368 38.9027 34.7280 13.9396 39.9910 291.0108 226.5319 37.7088 10.8848 40.9294 2.2796 48.2073 19.6018 17.1957 61.2290 80.4527 3.7125 38.3486 21.2501 15.4325 6.3781 15.6855 6.0245 1.2563 12.8085 43.6685 10.0142 3.0533 16.8605 3.8194 10.2964 3.2016 16.4482 18.7476 11.4690 10.4327 8.2796 2.6057 53.8137 6.9932 34.8885 5.0198 3.5479 4.6468 5.7727 6.3916 23.9224 5.5401 33.8789 84.1737 19.2522 1.1136 29.5010 3.0284 39.4796 10.5206 166.5143 7.9165 62.2777 33.7219 369.1463 11.6839 65.2226 63.4225 123.0202 16.4570 37.4448 67.6563 6.6469 21.1630 7.1893 35.1139 23.3745 9.1736 18.9999 6.1746 244.2155 212.2920 183.8969 361.0884 90.8168 347.5012 399.2181 575.6885 81.4110 51.9686 20.5541 38.5650 40.6797 13.9976 31.8064 52.1146 28.0704 21.7931 25.5873 41.3329 17.4007 11.2930 15.2198 11.6134 54.5676 1.4407 19.9346 21.4214 49.5404 21.6144 21.0363 20.0317 45.8090
temp: 298.150 k
press: 1.00000 atm
elementType: 8 8 8 7 7 7 7 7 7 7 7 7 6 6 6 6 6 6 6 6 6 6 6 6 6 1 1 1 1 1 1 1 1 1 1 1 1 1 1 1 1 1 1 1 1 1 1 1 1 1
symmnumber: 1
zpe: 1077207.1 jmol-1
zpe.correction: 0.410287 hartree
zpe.thermalcorrener: 0.436902 hartree
zpe.thermalcorrenthalpy: 0.437846 hartree
zpe.thermalcorrgfe: 0.349874 hartree
zpe.sumelectzpe: -1226.861908 hartree
zpe.sumelectthermal: -1226.835293 hartree
zpe.sumelectthermalent: -1226.834349 hartree
zpe.sumelectthermalfe: -1226.922321 hartree
dipole: 10.2207 -2.4773 -2.6013
dipole: 10.8336
quadrupole: -125.6585 -143.4198 -155.8442
quadrupole: -9.3325 -5.1904 16.6826
quadrupole: 15.9823 -1.7789 -14.2034 -9.3325 -5.1904 16.6826
hfenergy: -1227.2721946 hartree
pointgroup: C01 [X(C13H25N9O3)]
dipole: 3.9677831 1.2467127 0.932393 debye
polarizability: 295.5723732|13.9561233|221.9325106|15.6407346|-18.3403042|152.3059055 unknown
InChI: InChI=1S/C13H25N9O3/c1-22-9(6-19-20-7-18-13(16)25)11(24)21-8(5-10(22)23)3-2-4-17-12(14)15/h7-9,19-21H,2-6,14-16H2,1H3
charge 0 multiplicity 1
50 atoms
O  -0.772079 -3.022834 1.416658
O  0.182851 0.712717 -2.458298
O  -7.793008 0.844266 -0.385111
N  -1.234377 -1.057191 0.235781
N  1.467242 -0.58537 -1.05182
N  -2.804199 1.497325 0.40779
N  5.77832 0.80602 0.29871
N  -3.937749 2.258024 0.064642
N  8.19232 0.926174 0.563916
N  6.872351 2.866311 0.577834
N  -5.464971 0.435246 0.152254
N  -7.027223 -1.269384 0.250444
C  1.935009 -1.358747 0.136899
C  0.971144 -1.311306 1.348823
C  -0.750039 0.274163 -0.213971
C  3.352821 -0.891387 0.556496
C  -0.422059 -1.865295 1.02279
C  0.331209 0.14956 -1.326745
C  4.447094 -1.101186 -0.511448
C  -1.873399 1.207679 -0.704647
C  -2.523179 -1.589748 -0.25957
C  5.831834 -0.637288 -0.006999
C  6.899058 1.467015 0.477403
C  -5.190584 1.700306 -0.067143
C  -6.850624 0.071525 -0.025676
H  1.998172 -2.422113 -0.182418
H  1.386349 -1.979544 2.120393
H  0.946331 -0.292359 1.778376
H  -0.267518 0.774854 0.651129
H  3.636153 -1.459858 1.466548
H  3.33591 0.179397 0.832526
H  2.107524 -0.613316 -1.853327
H  4.219011 -0.516588 -1.424773
H  4.501467 -2.172264 -0.796838
H  -1.388672 2.111847 -1.133209
H  -2.442237 0.737879 -1.522483
H  -2.495676 -1.727329 -1.357821
H  -2.659141 -2.574195 0.215357
H  -3.356016 -0.919815 0.016158
H  6.596913 -0.879588 -0.783788
H  6.090654 -1.2348 0.900055
H  -2.369253 1.821124 1.280199
H  -3.821508 3.231409 -0.247223
H  -5.963534 2.42972 -0.377159
H  9.006182 1.495501 0.342883
H  8.311002 -0.081654 0.605348
H  7.529606 3.339691 1.195925
H  5.954412 3.288259 0.448559
H  -7.9549 -1.677524 0.169564
H  -6.228094 -1.825824 0.546305
