program: Gaussian 09
title: 000130963
version: EM64L-G09RevD.01
frameworkgroup: C1[X(C15H17NOS)]
method: RPBEPBE
basis: SDD
operation: Freq
keyword: #p
keyword: freq=noraman
keyword: PBEPBE/SDD
title: #p freq=noraman PBEPBE/SDD
converged: YES YES NO NO
title: Mulliken charges:
elementType: S O N C C C C C C C C C C C C C C C H H H H H H H H H H H H H H H H H
charge: 0.200255 -0.440573 -0.115933 -0.517537 0.474946 -0.382403 -0.386914 -0.174313 -0.625478 -0.611035 -0.244728 -0.233310 -0.120367 -0.367669 -0.332817 0.305895 -0.175658 -0.369967 0.237259 0.198117 0.242380 0.253962 0.255738 0.195275 0.211466 0.217744 0.198419 0.243357 0.230158 0.233158 0.315933 0.251746 0.227893 0.250842 0.354161
chargesum: 0.00000
title: Mulliken charges with hydrogens summed into heavy atoms:
elementType: S O N C C C C C C C C C C C C C C C
charge: 0.200255 -0.086412 -0.115933 -0.082161 0.474946 -0.382403 -0.144534 0.079649 0.037000 0.048485 -0.014571 -0.000152 -0.120367 -0.051737 -0.081071 0.305895 0.052236 -0.119125
polarizability: 2.30610096e+02 7.86427899e+00 1.86830437e+02 -1.00082069e+01 -4.25978401e+00 1.47158964e+02
1716.lowfreq: -11.4448 -3.0646 -0.0021 -0.0019 -0.0009 3.5334 23.0652 32.4383 46.0943
frequency: 22.9565 32.2829 46.0081 52.6821 70.0242 86.9043 151.6170 174.0706 206.2175 221.1583 224.0498 227.0081 254.2585 285.1014 320.4748 337.7177 368.5261 380.1428 388.7899 413.5088 419.6884 428.4744 448.6172 482.1309 516.4764 528.3291 576.1893 606.9095 663.8382 664.2581 688.0990 731.5798 764.1885 786.1452 812.2261 830.3203 848.3761 886.4817 888.2143 934.8767 947.6889 959.7419 967.3395 978.1882 992.9278 1008.3156 1021.7873 1031.8411 1044.4318 1061.8498 1088.0659 1093.2291 1114.9426 1135.9602 1145.6891 1164.6251 1168.3626 1173.6277 1210.4318 1242.1527 1253.1431 1258.0217 1288.9907 1318.7933 1359.4384 1373.3962 1388.7306 1417.0158 1420.4245 1424.3783 1437.9381 1454.8257 1460.0013 1461.8207 1471.0091 1475.4772 1481.2711 1486.2257 1575.0823 1588.1547 1597.3434 1606.4085 2860.3904 2862.6548 2879.3553 3010.4536 3021.1420 3025.3858 3049.3711 3081.4968 3085.1747 3115.4818 3134.3693 3136.4493 3149.5469 3161.1599 3165.8992 3175.5921 3577.2332
redmass: 4.5682 4.2911 3.6782 6.0982 3.0122 3.7173 4.3161 4.1936 2.5226 2.2560 2.2473 1.5729 2.1899 3.1928 3.7418 3.4355 6.6504 1.1271 2.2534 2.3820 3.9291 5.5767 3.2384 3.3867 7.6008 3.9951 5.1056 4.8537 6.1820 7.3636 2.4980 4.2148 1.3457 1.4624 3.3806 4.0520 6.9433 1.4389 1.4181 1.3345 1.7500 1.4153 1.3770 4.3411 1.3339 2.5828 5.7817 1.5684 2.1695 1.9195 1.2550 1.8215 1.5908 1.4252 1.4358 1.6536 1.0989 1.1227 2.2312 2.2225 2.2395 1.7184 1.4733 1.2765 1.4333 5.3893 8.1057 1.1491 2.6558 2.1082 1.1799 1.3165 1.6542 1.1041 1.0810 1.1788 1.7946 1.0546 6.2278 6.1429 6.5495 6.1741 1.0595 1.0654 1.0574 1.0977 1.0743 1.0752 1.0881 1.1002 1.1008 1.0878 1.0882 1.0870 1.0939 1.0933 1.1004 1.0980 1.0658
irintensity: 0.2849 0.3205 0.0267 0.1608 0.3855 0.6002 1.1744 0.3726 0.5206 0.5140 1.1428 0.7368 2.9219 2.2802 0.1908 12.1165 2.5726 119.4963 10.1091 0.3337 11.4765 4.4635 7.4609 13.2343 2.5043 2.3765 3.6943 5.3793 9.0393 1.3212 23.2909 17.3858 62.5562 49.9190 28.4054 2.3527 49.5157 1.3861 0.2057 18.4984 2.2748 2.5460 0.4706 3.7754 0.1187 41.4793 29.5261 9.1949 2.8885 12.3661 5.8836 31.7953 4.0856 1.6239 160.8992 7.1153 0.5272 1.7606 7.2799 5.3746 21.7170 3.5160 4.7789 12.8617 6.5081 1.1360 8.3980 9.2765 47.7186 4.2833 7.8634 9.5336 27.0662 5.9646 14.9836 9.8167 34.3052 15.5983 6.8647 90.2623 1.0451 44.8082 57.9424 66.1783 291.9545 78.3019 25.9523 43.2190 5.7419 17.1985 35.9452 9.0934 6.8821 11.3946 18.8178 7.6509 25.2495 14.9181 21.3203
temp: 298.150 k
press: 1.00000 atm
elementType: 16 8 7 6 6 6 6 6 6 6 6 6 6 6 6 6 6 6 1 1 1 1 1 1 1 1 1 1 1 1 1 1 1 1 1
symmnumber: 1
zpe: 738150.7 jmol-1
zpe.correction: 0.281147 hartree
zpe.thermalcorrener: 0.298881 hartree
zpe.thermalcorrenthalpy: 0.299825 hartree
zpe.thermalcorrgfe: 0.234098 hartree
zpe.sumelectzpe: -1108.488187 hartree
zpe.sumelectthermal: -1108.470453 hartree
zpe.sumelectthermalent: -1108.469509 hartree
zpe.sumelectthermalfe: -1108.535236 hartree
dipole: 2.8113 1.2523 -0.9138
dipole: 3.2103
quadrupole: -110.2064 -103.7384 -116.8214
quadrupole: 8.0262 -6.2668 2.8283
quadrupole: 0.0490 6.5170 -6.5660 8.0262 -6.2668 2.8283
hfenergy: -1108.7693336 hartree
pointgroup: C01 [X(C15H17N1O1S1)]
dipole: -1.148056 -0.1882507 -0.4917527 debye
polarizability: 229.5648184|-4.2035168|184.0483269|17.1475075|7.3694936|150.9863512 unknown
InChI: InChI=1S/C15H17NOS/c1-16(2)11-12-6-3-4-9-15(12)18-14-8-5-7-13(17)10-14/h3-10,17H,11H2,1-2H3
charge 0 multiplicity 1
35 atoms
S  0.099072 0.715074 1.97365
O  2.443003 -2.085104 -1.874121
N  -1.75899 -1.883664 0.036019
C  -2.48551 -0.818977 0.793003
C  -2.200184 0.577817 0.257972
C  -1.055499 1.327506 0.648704
C  -3.095543 1.169053 -0.672347
C  -0.810678 2.608846 0.103115
C  -2.304725 -2.091602 -1.321926
C  -1.683831 -3.143195 0.810656
C  -2.852666 2.444623 -1.226576
C  -1.698753 3.165334 -0.84427
C  1.562328 0.170017 0.970576
C  1.392344 -0.756932 -0.079723
C  2.840144 0.659656 1.322903
C  2.532998 -1.173415 -0.80417
C  3.968494 0.204447 0.596833
C  3.825951 -0.704243 -0.4720
H  -2.151502 -0.886207 1.842859
H  -3.588992 -1.00431 0.773766
H  -3.998033 0.614887 -0.959028
H  0.073204 3.166049 0.4298
H  -2.245191 -1.153454 -1.899352
H  -3.37199 -2.429074 -1.315559
H  -1.710078 -2.861871 -1.846555
H  -1.096765 -3.89094 0.247625
H  -2.686234 -3.588152 1.028891
H  -1.169786 -2.954251 1.768969
H  -3.559768 2.874557 -1.944603
H  -1.498103 4.157117 -1.263968
H  0.384258 -1.155521 -0.288372
H  2.949824 1.383582 2.135885
H  4.965564 0.574066 0.860471
H  4.686623 -1.053771 -1.049568
H  1.497416 -2.327148 -2.037558
