program: Gaussian 09
title: 000130950
version: EM64L-G09RevD.01
frameworkgroup: C1[X(C12H11N3O2)]
method: RPBEPBE
basis: SDD
operation: Freq
keyword: #p
keyword: freq=noraman
keyword: PBEPBE/SDD
title: #p freq=noraman PBEPBE/SDD
converged: NO YES NO NO
title: Mulliken charges:
elementType: O O N N N C C C C C C C C C C C C H H H H H H H H H H H
charge: -0.211449 -0.224524 -0.171138 -0.393508 -0.398928 -0.157471 -0.441348 0.261621 0.169142 0.279156 -0.223559 -0.428145 0.190362 -0.339764 -0.400077 -0.232426 -0.241827 0.296712 0.263663 0.239978 0.352061 0.262458 0.259483 0.356125 0.241782 0.241802 0.225033 0.224786
chargesum: 0.00000
title: Mulliken charges with hydrogens summed into heavy atoms:
elementType: O O N N N C C C C C C C C C C C C
charge: -0.211449 -0.224524 -0.171138 -0.041446 -0.042803 0.139241 0.062293 0.261621 0.169142 0.279156 0.038899 -0.168662 0.190362 -0.097982 -0.158275 -0.007393 -0.017042
polarizability: 2.03475443e+02 -1.08530862e+01 1.64215525e+02 2.21384428e+01 -3.89013978e+00 9.05034869e+01
1716.lowfreq: -11.7641 -5.1708 -0.0006 0.0003 0.0004 6.6886 27.7976 33.7861 50.7531
frequency: 27.7523 33.7674 50.7489 91.7677 146.9338 161.0913 189.2197 218.0055 256.2530 309.3622 381.5296 423.2246 427.6540 462.1047 488.2976 530.8550 549.7202 568.8563 584.5168 601.9067 608.4519 621.1900 664.4505 686.1167 719.3463 732.4501 747.1713 750.5067 753.7905 775.8468 850.5126 860.7951 864.6500 873.5112 935.8037 938.1720 956.1244 975.5170 1008.6493 1013.9010 1056.8047 1082.8545 1101.6357 1131.8689 1169.1738 1174.2046 1189.8474 1208.4971 1231.7956 1255.7180 1296.2339 1310.5317 1320.7120 1331.4094 1346.3831 1358.6665 1369.2507 1372.6219 1418.0196 1456.0929 1467.6011 1478.6499 1514.1073 1583.7016 1624.5060 1682.1936 1728.2075 3001.4439 3020.9200 3088.0757 3126.6209 3134.5384 3148.3573 3165.3056 3206.2362 3233.0079 3590.1881 3600.7991
redmass: 7.1815 5.6490 5.3645 6.3223 5.3644 9.2275 5.7310 4.1582 3.4134 4.8609 8.4695 2.9001 3.8300 2.9038 1.1399 5.9666 3.9272 4.2921 3.4729 9.2568 3.5359 3.5621 1.5655 4.7625 6.5689 1.5119 3.3516 1.7112 4.6165 2.0479 1.4005 1.8595 2.2114 4.9696 1.4072 2.6396 3.3719 1.3071 2.3211 2.2543 2.2173 2.0194 2.2093 1.4614 1.1051 2.6681 1.6052 1.7336 1.9243 1.5551 2.1543 1.7639 2.3536 1.8749 1.6998 1.9025 2.7298 1.7520 3.8915 1.8105 2.7621 1.7239 4.4718 6.6692 7.3349 8.6025 9.4802 1.0835 1.0603 1.1051 1.0853 1.0890 1.0953 1.1002 1.0904 1.1065 1.0802 1.0806
irintensity: 0.2683 0.8385 0.3166 0.3786 4.6523 3.4347 1.1998 5.9446 2.7692 2.7008 18.7078 4.5785 18.5664 8.0149 82.9570 0.2037 22.0875 4.9165 12.2574 11.7664 16.8452 43.4144 88.6148 10.3496 62.3635 7.6753 15.4663 105.7472 3.3593 47.9661 0.5507 6.9474 18.7881 1.8619 5.4124 14.1782 18.5052 0.1132 0.5000 12.3769 5.7506 13.8027 33.7784 0.4986 0.1907 45.7586 51.6061 12.9763 109.2766 27.4455 158.4575 21.5035 1.5269 137.9318 14.2694 3.6292 31.0987 10.7024 10.8808 38.5118 21.9030 29.3611 25.2169 0.3648 4.3002 532.5988 462.9819 6.0920 17.5330 7.0386 1.3182 5.3903 30.9137 26.2849 0.5235 2.4431 90.1917 44.9142
temp: 298.150 k
press: 1.00000 atm
elementType: 8 8 7 7 7 6 6 6 6 6 6 6 6 6 6 6 6 1 1 1 1 1 1 1 1 1 1 1
symmnumber: 1
zpe: 564740.9 jmol-1
zpe.correction: 0.215098 hartree
zpe.thermalcorrener: 0.228758 hartree
zpe.thermalcorrenthalpy: 0.229703 hartree
zpe.thermalcorrgfe: 0.172885 hartree
zpe.sumelectzpe: -777.421812 hartree
zpe.sumelectthermal: -777.408152 hartree
zpe.sumelectthermalent: -777.407208 hartree
zpe.sumelectthermalfe: -777.464026 hartree
dipole: -1.3216 -0.2569 0.4705
dipole: 1.4262
quadrupole: -104.3650 -104.0451 -100.8438
quadrupole: 5.2113 7.5102 -7.0621
quadrupole: -1.2803 -0.9605 2.2408 5.2113 7.5102 -7.0621
hfenergy: -777.6369107 hartree
pointgroup: C01 [X(C12H11N3O2)]
dipole: 0.517197 -0.1131469 -0.1858824 debye
polarizability: 204.0621329|10.5519289|163.9495138|21.4439132|2.2177677|90.1828078 unknown
InChI: InChI=1S/C12H11N3O2/c16-11-9(13-12(17)14-11)7-15-6-5-8-3-1-2-4-10(8)15/h1-6,9,13-14H,7H2
charge 0 multiplicity 1
28 atoms
O  -2.822579 2.481225 -0.684049
O  -4.209171 -1.655365 1.130238
N  0.594934 -0.40432 -0.876976
N  -2.056679 -0.741804 0.653715
N  -3.852748 0.521184 0.191719
C  -1.505997 0.510095 0.122231
C  -0.635995 0.328952 -1.15772
C  1.748227 0.135852 -0.279471
C  -2.780493 1.333147 -0.181867
C  2.675319 -0.946783 -0.068539
C  0.778396 -1.793898 -1.026712
C  2.035564 -2.155013 -0.550408
C  -3.445746 -0.754012 0.718883
C  2.048411 1.470775 0.076365
C  3.938868 -0.665922 0.516016
C  3.309922 1.717833 0.655038
C  4.243876 0.661526 0.873387
H  -0.903429 1.045786 0.88177
H  -0.403874 1.331918 -1.558327
H  -1.217919 -0.216953 -1.920102
H  -1.493428 -1.50996 1.014891
H  0.000874 -2.404129 -1.485205
H  2.454946 -3.159449 -0.555881
H  -4.836352 0.77985 0.110685
H  1.344043 2.292406 -0.095226
H  4.664478 -1.469189 0.684472
H  3.579242 2.740652 0.940468
H  5.21431 0.893997 1.325402
