program: Gaussian 09
title: 000131129
version: EM64L-G09RevD.01
frameworkgroup: C1[X(C19H28O10)]
method: RPBEPBE
basis: SDD
operation: Freq
keyword: #p
keyword: freq=noraman
keyword: PBEPBE/SDD
title: #p freq=noraman PBEPBE/SDD
converged: NO YES NO NO
title: Mulliken charges:
elementType: O O O O O O O O O O C C C C C C C C C C C C C C C C C C C H H H H H H H H H H H H H H H H H H H H H H H H H H H H
charge: -0.281815 -0.345196 -0.222005 -0.284614 -0.464378 -0.424661 -0.422539 -0.446737 -0.462327 -0.497681 0.004088 -0.171834 -0.114791 -0.151347 0.002457 -0.339339 -0.070137 -0.171610 -0.185059 -0.073889 -0.402675 -0.249908 -0.580026 0.484780 -0.431729 -0.375897 -0.240239 -0.240719 -0.264826 0.208408 0.248345 0.221930 0.251087 0.197535 0.229727 0.253044 0.252271 0.253513 0.278984 0.250207 0.279771 0.242444 0.366629 0.354838 0.352253 0.236361 0.205851 0.375079 0.367092 0.362807 0.209640 0.228869 0.233121 0.254864 0.231204 0.239102 0.239677
chargesum: 0.00000
title: Mulliken charges with hydrogens summed into heavy atoms:
elementType: O O O O O O O O O O C C C C C C C C C C C C C C C C C C C
charge: -0.281815 -0.345196 -0.222005 -0.284614 -0.097749 -0.069823 -0.070286 -0.071658 -0.095235 -0.134875 0.212497 0.076511 0.107140 0.099740 0.199992 0.143432 0.182134 0.081903 0.093925 0.176318 0.119540 0.192304 -0.141517 0.484780 -0.198608 -0.121033 -0.009035 -0.001616 -0.025149
polarizability: 2.60335169e+02 7.69140254e+00 2.28682624e+02 1.46218395e+00 -1.04366766e+01 1.96402098e+02
1716.lowfreq: -10.8531 -5.9166 -0.0002 0.0001 0.0007 8.5448 19.3486 24.0296 26.2716
frequency: 18.2852 23.6572 26.0828 40.6776 44.3409 50.8855 58.9957 73.2262 86.6802 91.6731 107.9678 120.5958 149.8346 159.6143 175.4836 185.1874 211.2436 221.5015 237.3083 242.6526 246.4681 251.9098 277.9728 280.3954 309.7448 312.6045 317.5907 327.9354 330.7862 346.9300 358.8962 362.5380 380.9431 403.7337 406.2310 413.4210 435.0510 444.1258 448.9174 474.4547 488.7237 500.6923 538.7878 540.1465 548.2743 558.5838 565.6594 575.5470 604.2336 609.7234 617.8073 626.8831 689.9780 706.6325 755.0768 764.3202 776.2000 803.3694 820.4116 827.6045 844.2939 857.7347 871.5973 895.2979 908.1846 918.9964 939.6172 951.2282 955.6938 963.2009 977.7138 978.2900 990.3275 995.7339 1001.1133 1003.7454 1006.4667 1014.9486 1021.8414 1027.3844 1029.1431 1038.1908 1039.6683 1045.3974 1060.8617 1064.6611 1067.4155 1084.0575 1095.7720 1103.6498 1119.8216 1146.3677 1163.0453 1167.8700 1170.8845 1184.1871 1189.5563 1208.7259 1214.1709 1216.5364 1226.5538 1236.5522 1242.5893 1247.4402 1247.8514 1255.1970 1261.3574 1272.6370 1280.1993 1282.2907 1314.4157 1323.9582 1324.2228 1327.1081 1335.3881 1338.3332 1340.5801 1346.8222 1348.3077 1353.5496 1357.9747 1373.0868 1378.0324 1381.0130 1381.9150 1394.4009 1415.8692 1416.3153 1434.6856 1440.1317 1451.7198 1458.0714 1474.2369 1477.9525 1485.4127 1590.0186 1612.0429 2899.9197 2933.2572 2954.5820 2958.6924 2992.1158 2994.9090 3001.7186 3016.0722 3023.0789 3029.4472 3043.2690 3050.6265 3056.3365 3061.3295 3063.5279 3072.3965 3090.0714 3114.3185 3123.5330 3137.1492 3150.3790 3162.9705 3341.2622 3380.3670 3537.2847 3565.8195 3566.5689 3585.5481
redmass: 5.4751 6.0119 5.2417 5.6504 5.6285 5.4770 4.8423 5.0159 6.1479 5.9008 5.5263 5.9169 3.9499 3.6486 6.1985 4.6310 4.8152 5.9032 4.7042 3.8012 4.9339 3.7709 2.6060 3.2244 4.8427 2.2090 1.7868 5.6907 2.7353 1.3860 1.4290 2.4865 3.0084 2.8353 3.9998 3.4074 1.5994 2.8369 2.8911 4.1098 4.2627 4.8713 2.1078 4.2499 2.4870 2.3747 3.4728 3.5826 3.1832 1.5577 5.9127 2.7545 4.1934 1.8517 3.1184 5.2361 1.8518 3.2374 3.1046 3.5295 3.2185 1.2493 3.1636 4.0746 3.7445 1.3863 6.9007 5.0390 3.5732 4.2458 2.7217 1.4872 5.2345 3.3511 1.3461 4.3615 3.3133 3.4716 4.0218 2.1312 3.2193 2.5361 3.6478 2.0976 2.6153 2.2889 2.6488 1.9716 3.4481 2.5288 1.9972 2.1819 1.1747 1.1723 1.0620 1.1813 1.1231 1.2290 1.7569 1.4008 1.2267 1.1894 1.1436 1.2558 1.1796 1.2105 1.2942 1.2780 1.1651 1.3277 1.2619 1.4782 1.2792 1.2995 1.4399 1.2380 1.3374 1.3755 1.4782 1.3819 1.4722 1.5522 1.4269 5.8846 1.3514 1.4466 1.3810 1.4445 1.1777 2.1405 1.0796 1.1103 1.0963 1.2670 1.7368 6.0214 6.0947 1.0827 1.0814 1.0820 1.0619 1.0588 1.0609 1.0846 1.0664 1.0849 1.0788 1.1014 1.0880 1.1013 1.0865 1.1052 1.0884 1.1058 1.0862 1.0875 1.0923 1.0961 1.1003 1.0666 1.0663 1.0651 1.0663 1.0658 1.0667
irintensity: 0.9084 0.3799 0.6282 0.7123 0.9306 0.9974 0.4924 1.5182 5.7870 4.2843 0.7653 0.4439 1.9787 8.6646 11.0467 2.0824 0.8566 7.0571 26.7654 15.6972 3.7055 6.6160 20.9078 36.9268 3.9645 7.2049 44.6448 18.1984 30.2479 14.6168 185.2529 42.7458 6.8146 0.4611 16.2161 8.1971 69.0190 37.4098 33.6609 4.1571 11.0733 6.3843 65.9343 17.1133 6.2584 88.1663 9.3684 6.6672 15.8710 129.3090 1.3703 54.1957 5.5160 56.5244 21.8198 21.8568 41.1473 9.1408 7.9371 8.7428 39.7897 0.7590 73.2748 80.6249 24.3395 3.0925 123.3267 31.7183 159.3377 118.0059 8.7910 0.3987 6.2166 46.7372 3.6602 145.8373 12.1301 177.9464 86.7486 14.4145 23.1112 70.1103 25.5671 76.9278 23.9118 7.0006 26.2433 10.3567 56.4432 34.6509 10.0311 12.2759 11.6017 29.1487 0.9787 2.7125 0.4195 8.7984 5.5601 14.8983 10.8613 19.9216 31.6530 4.0344 15.5034 24.3116 37.4926 8.6789 6.0894 1.9512 41.5728 0.1467 18.8251 0.7135 9.1367 4.2762 11.3094 4.4223 16.5051 0.8968 6.2470 2.0315 3.6373 0.3600 2.3901 3.9326 7.7309 28.2527 107.0626 9.0235 19.3093 15.3162 3.8350 14.2550 18.7789 0.7229 6.4693 45.5483 25.9182 24.9224 61.6133 52.3803 37.6300 19.8189 7.6763 53.2935 41.1420 20.1387 26.9298 26.8927 37.0830 4.9574 27.6552 5.1006 5.5990 2.5823 22.0775 28.1507 6.9348 141.7445 150.2655 15.4728 3.6871 11.0427 17.0850
temp: 298.150 k
press: 1.00000 atm
elementType: 8 8 8 8 8 8 8 8 8 8 6 6 6 6 6 6 6 6 6 6 6 6 6 6 6 6 6 6 6 1 1 1 1 1 1 1 1 1 1 1 1 1 1 1 1 1 1 1 1 1 1 1 1 1 1 1 1
symmnumber: 1
zpe: 1209684.0 jmol-1
zpe.correction: 0.460744 hartree
zpe.thermalcorrener: 0.489659 hartree
zpe.thermalcorrenthalpy: 0.490603 hartree
zpe.thermalcorrgfe: 0.400259 hartree
zpe.sumelectzpe: -1490.716547 hartree
zpe.sumelectthermal: -1490.687632 hartree
zpe.sumelectthermalent: -1490.686688 hartree
zpe.sumelectthermalfe: -1490.777032 hartree
dipole: -1.2421 3.4680 -4.2434
dipole: 5.6193
quadrupole: -177.0646 -178.4649 -172.1615
quadrupole: -21.1103 -9.8244 -5.2246
quadrupole: -1.1676 -2.5679 3.7355 -21.1103 -9.8244 -5.2246
hfenergy: -1491.1772908 hartree
pointgroup: C01 [X(C19H28O10)]
dipole: -1.0520685 -0.4746739 -1.8855965 debye
polarizability: 226.1083632|-11.1096533|258.6908994|14.2474753|4.2969068|200.6206286 unknown
InChI: InChI=1S/C19H28O10/c20-11-8-27-18(16(24)13(11)21)28-9-12-14(22)15(23)17(25)19(29-12)26-7-6-10-4-2-1-3-5-10/h1-5,11-25H,6-9H2
charge 0 multiplicity 1
57 atoms
O  -0.278258 1.43962 -0.86521
O  2.620166 1.06871 -0.209387
O  2.214347 -1.078042 -1.259036
O  -2.553676 0.925764 -0.582891
O  1.720799 4.329365 0.472288
O  -0.657005 4.461936 2.031648
O  -3.031143 3.584469 0.549684
O  4.644455 -2.00566 0.2919
O  2.022838 -0.092843 2.222266
O  2.335265 -3.435815 0.63127
C  0.744157 2.505415 -0.934363
C  0.740297 3.232184 0.429216
C  -0.631741 3.88952 0.690105
C  -1.762629 2.857443 0.592489
C  -1.632656 2.014665 -0.695998
C  2.067091 1.856683 -1.332006
C  3.205957 -0.237649 -0.621986
C  3.81158 -0.866131 0.659267
C  2.684143 -1.267411 1.647205
C  1.635627 -2.157449 0.928855
C  1.109682 -1.486692 -0.346318
C  -2.755189 0.179389 -1.850385
C  -3.613186 -1.060618 -1.543976
C  -2.879922 -2.171918 -0.803571
C  -2.452566 -3.336718 -1.492298
C  -2.614879 -2.073521 0.587952
C  -1.781887 -4.380957 -0.812391
C  -1.949087 -3.115067 1.271901
C  -1.530387 -4.274874 0.575658
H  0.478244 3.236336 -1.733727
H  0.937136 2.497254 1.2339
H  -0.794202 4.678291 -0.078763
H  -1.707755 2.173738 1.464644
H  -1.858865 2.648018 -1.588893
H  2.801085 2.638535 -1.606053
H  1.888146 1.188527 -2.194237
H  3.98174 -0.088849 -1.393702
H  4.478743 -0.128516 1.136097
H  3.119741 -1.828977 2.489346
H  0.788123 -2.33964 1.615484
H  0.49264 -0.605224 -0.096182
H  0.499988 -2.181342 -0.947937
H  2.604448 3.963046 0.725802
H  0.116001 5.082628 2.088792
H  -3.761811 2.92028 0.633452
H  -1.769943 -0.102753 -2.265268
H  -3.280799 0.844529 -2.567857
H  4.029475 -2.792028 0.190892
H  1.982233 0.596603 1.498529
H  1.740931 -4.017229 0.093608
H  -3.990866 -1.445669 -2.510399
H  -4.494551 -0.724146 -0.965207
H  -2.658029 -3.434842 -2.565832
H  -2.929796 -1.174981 1.128877
H  -1.476729 -5.280125 -1.360181
H  -1.767228 -3.02789 2.349335
H  -1.035491 -5.09227 1.113195
