program: Gaussian 09
title: 000010528
version: EM64L-G09RevD.01
frameworkgroup: C1[X(C20H25NO2)]
method: RPBEPBE
basis: SDD
operation: Freq
keyword: #p
keyword: freq=noraman
keyword: PBEPBE/SDD
title: #p freq=noraman PBEPBE/SDD
converged: YES YES NO NO
title: Mulliken charges:
elementType: O O N C C C C C C C C C C C C C C C C C C C C H H H H H H H H H H H H H H H H H H H H H H H H H
charge: -0.251180 -0.249381 -0.097437 0.112811 -0.470043 -0.374309 0.423235 0.188054 -0.737588 -0.371514 -0.402575 -0.621104 -0.629967 -0.256979 -0.250952 -0.482438 -0.244906 0.474884 -0.374143 -0.390780 -0.229896 -0.227207 -0.233097 0.227616 0.214453 0.236404 0.212871 0.226808 0.235889 0.212895 0.248882 0.246876 0.221818 0.221698 0.190460 0.210358 0.207914 0.250988 0.225155 0.223118 0.223265 0.238037 0.228128 0.270775 0.235267 0.229469 0.227367 0.230002
chargesum: 0.00000
title: Mulliken charges with hydrogens summed into heavy atoms:
elementType: O O N C C C C C C C C C C C C C C C C C C C C
charge: -0.251180 -0.249381 -0.097437 0.112811 -0.027975 0.074965 0.423235 0.188054 -0.061996 -0.122632 -0.155699 0.012873 0.039293 -0.031824 -0.027834 -0.021136 -0.016778 0.474884 -0.103368 -0.155513 -0.000427 0.000160 -0.003095
polarizability: 2.67613555e+02 -3.80527310e+01 1.91288849e+02 -5.79296669e+00 -2.90058794e-01 2.07021778e+02
1716.lowfreq: -10.9247 -6.3339 -0.0010 -0.0009 -0.0008 6.0958 19.5164 28.3337 31.5369
frequency: 19.1801 28.2833 31.4715 36.3274 54.7811 61.9878 76.2325 83.5376 97.6762 109.3433 143.3528 166.8904 193.0510 213.7518 218.8760 239.1016 242.9624 249.8375 260.1826 293.1167 307.2108 325.2224 339.4741 356.4914 385.4873 397.8917 402.6528 403.4034 444.5071 461.6257 498.4725 526.8295 564.8739 597.7477 616.8487 617.4927 655.7708 696.3313 702.7543 705.2733 730.0565 754.6460 761.3310 771.5112 813.4432 817.3231 825.9900 849.2102 859.2110 884.7773 907.3262 923.7039 938.0868 971.8186 974.9008 983.4407 988.2252 990.1491 991.9818 993.9172 1001.4781 1005.6307 1027.0689 1028.2770 1032.2265 1047.3621 1081.2221 1088.3389 1089.7506 1091.3026 1093.8946 1126.0048 1138.5209 1171.8245 1173.4789 1175.9141 1182.8723 1188.6789 1201.1521 1205.9612 1221.0493 1233.2712 1262.5619 1284.6968 1313.5286 1325.3099 1330.0323 1341.3570 1344.0577 1366.6473 1377.7068 1383.1632 1385.4926 1420.1644 1433.1345 1442.3954 1443.3804 1451.1683 1459.9259 1460.7539 1463.2556 1473.7219 1476.4024 1478.2388 1485.0062 1485.7707 1487.5822 1496.5992 1588.6481 1594.0032 1601.1811 1612.2534 1614.7541 2853.2648 2883.9962 2897.8382 2980.9755 3013.8437 3020.3264 3028.8693 3032.1826 3036.8559 3064.5055 3073.0145 3074.2141 3083.0210 3089.8686 3110.9075 3119.3205 3121.4636 3127.6881 3129.0424 3139.6375 3142.4420 3150.4573 3155.0980 3164.5653 3166.2516
redmass: 4.3045 4.7122 3.7058 4.1880 3.1756 4.2779 2.5412 4.4787 3.3750 5.6327 3.4445 2.9150 2.4440 1.9449 3.0960 1.2791 2.1163 2.1110 1.7620 3.0627 4.0410 2.4243 3.1306 4.1600 2.3029 2.6123 2.7243 2.8005 2.4145 2.8529 4.2051 3.6817 4.0937 4.4832 6.2972 6.3004 3.9713 4.1014 1.7769 1.9541 2.0648 2.2674 2.1691 2.2402 2.9358 3.6180 3.5817 1.2501 1.2531 3.5730 1.9814 1.7689 1.5219 1.7461 1.4391 1.4428 2.9383 5.0831 2.1044 1.5223 1.3393 2.7628 2.2032 2.1953 1.7683 1.9023 2.0923 1.2926 1.6465 2.0257 1.7759 2.1028 2.0525 1.5750 1.0542 1.5786 2.9856 1.1183 1.1716 2.7208 2.8533 1.1650 2.7118 1.2291 1.3122 1.3713 1.2598 1.4047 1.2611 1.5377 3.2572 1.2935 8.0820 1.1408 2.2098 2.0426 1.2007 1.0831 1.1261 1.0580 1.0664 1.0593 1.0547 1.2523 1.9614 1.6545 1.0750 1.1056 5.9173 6.2539 8.2662 6.6609 6.0787 1.0566 1.0560 1.0671 1.0352 1.0725 1.0607 1.0827 1.0825 1.0584 1.0995 1.1008 1.0983 1.1002 1.1020 1.1075 1.0867 1.0844 1.0873 1.0880 1.0921 1.0932 1.0964 1.0955 1.1016 1.0996
irintensity: 0.0887 0.1609 0.0714 0.2059 0.5938 0.1661 0.2393 0.4977 0.4786 1.2934 1.6065 1.0656 0.0406 1.3029 0.6775 0.1516 3.0499 2.2245 0.3738 0.5172 5.5399 4.2259 1.6834 9.3624 7.6264 1.6368 0.1081 0.0398 0.4309 0.4791 17.7214 5.0741 4.6882 22.9990 0.3430 0.3257 3.6833 1.9826 96.8603 7.1010 26.3520 56.1583 20.5327 42.1809 12.6014 10.4000 4.2278 0.7776 0.9857 53.6825 8.5955 0.8964 1.9241 2.7974 0.5101 0.4246 1.6807 3.3091 1.8786 5.4657 0.4404 141.2268 1.4949 33.4800 14.0062 27.1176 45.9522 6.5128 18.0555 59.1586 1.7634 139.3428 17.5091 6.9646 0.0955 8.7952 15.3899 0.3204 4.6061 45.9680 16.9306 8.5834 13.3766 3.1765 2.3083 0.9623 1.3845 5.6660 10.4628 0.4440 1.8946 15.7993 0.6802 2.2968 7.3625 9.5984 2.8004 11.3527 21.5416 4.3521 5.3152 6.4795 16.6891 34.1733 24.6066 7.3751 6.1277 5.5256 8.0150 12.4908 85.9940 25.5869 0.5676 120.8892 96.0392 80.7555 32.7047 42.8364 11.8187 34.4175 24.9679 27.6418 0.4846 24.6546 46.6797 46.3623 52.2453 4.0324 5.1027 1.5627 1.3093 3.9666 18.4006 23.0335 24.6432 36.6248 23.6137 15.1501
temp: 298.150 k
press: 1.00000 atm
elementType: 8 8 7 6 6 6 6 6 6 6 6 6 6 6 6 6 6 6 6 6 6 6 6 1 1 1 1 1 1 1 1 1 1 1 1 1 1 1 1 1 1 1 1 1 1 1 1 1
symmnumber: 1
zpe: 1055735.4 jmol-1
zpe.correction: 0.402108 hartree
zpe.thermalcorrener: 0.425176 hartree
zpe.thermalcorrenthalpy: 0.426120 hartree
zpe.thermalcorrgfe: 0.347729 hartree
zpe.sumelectzpe: -980.595925 hartree
zpe.sumelectthermal: -980.572857 hartree
zpe.sumelectthermalent: -980.571913 hartree
zpe.sumelectthermalfe: -980.650305 hartree
dipole: -1.0328 0.1226 -2.2598
dipole: 2.4876
quadrupole: -125.8030 -134.1373 -133.6319
quadrupole: -6.2023 -0.7460 -1.2198
quadrupole: 5.3877 -2.9466 -2.4412 -6.2023 -0.7460 -1.2198
hfenergy: -980.9980338 hartree
pointgroup: C01 [X(C20H25N1O2)]
dipole: 0.501027 -0.1815552 0.8209101 debye
polarizability: 232.6528982|51.8222964|228.9430199|13.501848|-0.9336865|204.3282633 unknown
InChI: InChI=1S/C20H25NO2/c1-4-20(16-21(2)3,18-13-9-6-10-14-18)19(22)23-15-17-11-7-5-8-12-17/h5-14H,4,15-16H2,1-3H3
charge 0 multiplicity 1
48 atoms
O  0.686924 -0.727036 -0.033117
O  0.044639 0.283172 -2.029551
N  -0.940819 2.126908 1.474499
C  -1.560028 0.212862 -0.116372
C  -1.344319 0.709106 1.351288
C  -2.383739 1.259739 -0.9325
C  -2.258244 -1.180882 -0.140052
C  -0.211798 -0.028466 -0.841082
C  -3.794384 1.518879 -0.368281
C  -2.575221 -1.764852 -1.396869
C  -2.587955 -1.905418 1.03319
C  -1.194552 2.644362 2.835008
C  0.435374 2.418945 1.022866
C  -3.215647 -3.019152 -1.478569
C  -3.232075 -3.161827 0.954234
C  1.994746 -1.12887 -0.669848
C  -3.552268 -3.725049 -0.300392
C  3.062753 -0.077098 -0.466717
C  3.230643 0.969748 -1.41017
C  3.912275 -0.126833 0.66779
C  4.227661 1.95118 -1.216993
C  4.910224 0.854132 0.862164
C  5.069586 1.896168 -0.081104
H  -0.624128 0.024276 1.860071
H  -2.316208 0.615964 1.869695
H  -1.817947 2.207958 -0.935518
H  -2.448085 0.924348 -1.982429
H  -4.383081 0.586645 -0.288422
H  -3.742203 1.989988 0.62927
H  -4.34538 2.210467 -1.03153
H  -2.311503 -1.237799 -2.320982
H  -2.342853 -1.506464 2.021454
H  -0.970498 3.725882 2.866111
H  -2.259858 2.508856 3.096284
H  -0.578836 2.14469 3.626041
H  0.643254 3.494005 1.169023
H  1.214492 1.831725 1.567593
H  0.546292 2.206073 -0.053664
H  -3.45005 -3.445237 -2.460734
H  -3.480688 -3.700221 1.876111
H  2.236511 -2.06789 -0.14765
H  1.802447 -1.315365 -1.740273
H  -4.051508 -4.698606 -0.3603
H  2.568885 1.01241 -2.282594
H  3.790186 -0.93542 1.399244
H  4.350364 2.755342 -1.951091
H  5.563115 0.804763 1.740819
H  5.845105 2.656392 0.066252
