program: Gaussian 09
title: 000130937
version: EM64L-G09RevD.01
frameworkgroup: C1[X(C7H11NO4)]
method: RPBEPBE
basis: SDD
operation: Freq
keyword: #p
keyword: freq=noraman
keyword: PBEPBE/SDD
title: #p freq=noraman PBEPBE/SDD
converged: YES YES NO NO
title: Mulliken charges:
elementType: O O O O N C C C C C C C H H H H H H H H H H H
charge: -0.448576 -0.241766 -0.412235 -0.241088 -0.589108 -0.122315 -0.258008 -0.548723 -0.453930 -0.159617 0.189849 0.183530 0.270772 0.288755 0.241611 0.274314 0.220256 0.214099 0.252525 0.270495 0.294600 0.379778 0.394783
chargesum: 0.00000
title: Mulliken charges with hydrogens summed into heavy atoms:
elementType: O O O O N C C C C C C C
charge: -0.068798 -0.241766 -0.017452 -0.241088 -0.024014 0.148456 0.030747 -0.032798 -0.019575 0.092908 0.189849 0.183530
polarizability: 1.05455667e+02 -8.12185133e+00 9.50617744e+01 -6.25850190e+00 -2.91549083e+00 7.56886115e+01
1716.lowfreq: -14.4818 -8.9539 -0.0007 -0.0007 -0.0005 8.6921 48.3421 59.2766 75.9118
frequency: 48.2154 59.2467 75.8913 88.9594 130.7480 169.5024 200.9532 231.8535 251.6653 271.8885 304.8391 385.5869 397.0846 431.0187 480.0872 543.2217 573.0888 580.8501 604.2291 625.6726 687.5234 716.9058 764.7652 790.9955 801.0640 870.8912 930.1883 933.1127 982.6717 996.5867 1047.9759 1072.8229 1076.1688 1088.4902 1097.0908 1107.4467 1114.7927 1179.4114 1203.5906 1214.6807 1245.8206 1276.1412 1278.8209 1318.1071 1344.1826 1404.8548 1413.0090 1451.8785 1452.5928 1610.0768 1664.1480 1666.0252 2975.1811 3028.6047 3047.5611 3101.7913 3118.4226 3160.2038 3211.8408 3472.6627 3483.1900 3513.5924 3610.7982
redmass: 7.3181 5.5419 10.6479 6.0167 3.6117 4.2570 3.7551 1.4320 3.6982 2.8861 2.3405 2.8789 3.6859 3.9622 2.8030 1.4428 2.0321 2.4847 1.4794 2.1025 3.4524 3.9295 3.1550 2.5279 2.9891 2.0576 1.7642 3.1699 2.1387 3.9148 1.9282 2.2097 1.4220 1.1816 1.7720 1.3224 1.5462 1.9525 1.4991 1.5606 1.5506 1.4434 1.3645 1.2210 1.7100 1.9002 1.7477 1.1550 1.4031 1.3275 7.3924 3.7032 1.0595 1.0939 1.0948 1.0560 1.0902 1.0914 1.1158 1.0447 1.0638 1.0639 1.0990
irintensity: 1.4569 2.3938 1.1487 5.3899 1.8340 2.3462 1.1979 54.3063 5.4030 17.6374 5.0842 12.5461 10.9670 13.6205 50.7794 81.6835 262.8044 53.9557 63.4912 189.6605 40.4029 14.4721 27.7765 7.5859 8.7744 16.2248 15.5338 21.6240 43.6150 44.7360 79.0994 253.1807 57.7918 48.1715 102.1715 3.3103 8.9205 12.8662 3.4340 0.9406 0.4053 0.3109 2.5821 8.2546 31.5534 15.6977 59.2804 11.1203 27.9565 156.7293 287.6585 60.6943 29.0660 7.1718 31.0764 10.8756 5.4869 0.7918 3.7509 5.4781 45.0070 28.1914 8.3470
temp: 298.150 k
press: 1.00000 atm
elementType: 8 8 8 8 7 6 6 6 6 6 6 6 1 1 1 1 1 1 1 1 1 1 1
symmnumber: 1
zpe: 472413.0 jmol-1
zpe.correction: 0.179933 hartree
zpe.thermalcorrener: 0.192704 hartree
zpe.thermalcorrenthalpy: 0.193648 hartree
zpe.thermalcorrgfe: 0.140462 hartree
zpe.sumelectzpe: -628.036816 hartree
zpe.sumelectthermal: -628.024045 hartree
zpe.sumelectthermalent: -628.023101 hartree
zpe.sumelectthermalfe: -628.076287 hartree
dipole: -0.1654 1.7937 0.3453
dipole: 1.8341
quadrupole: -75.6168 -63.4438 -74.7943
quadrupole: -13.9751 3.4207 3.2257
quadrupole: -4.3319 7.8412 -3.5093 -13.9751 3.4207 3.2257
hfenergy: -628.2167489 hartree
pointgroup: C01 [X(C7H11N1O4)]
dipole: -0.0056607 0.7135904 -0.1069963 debye
dipolederiv: -0.4100317 0.0057187 -0.0638683 0.0262137 -1.2302308 -0.3275619 -0.1102211 -0.2416741 -0.4047493 -0.7473014 0.0150948 0.3055831 -0.0511391 -0.5965219 -0.0346218 0.4267727 -0.0605261 -0.6372079 -0.695685 -0.12657 0.3296794 -0.2048933 -0.6373677 0.4053911 0.271061 0.269944 -0.5723424 -0.4681867 -0.0997583 0.0917565 0.0167708 -0.5570705 -0.1879966 0.3078053 -0.0758968 -0.833863 -0.9433273 0.1915292 -0.0679901 0.2129742 -0.458866 0.1828922 -0.1281042 0.1228858 -0.3463999 0.0395355 -0.0455801 -0.0540808 0.3118152 0.3354578 -0.0090516 -0.0267264 0.087867 0.0214769 -0.3716267 -0.3831719 0.0707065 -0.4688796 -0.5852434 0.0293116 -0.0039826 -0.0609484 -0.0098604 -0.0297072 0.1815721 -0.0650096 0.1072949 -0.0063209 -0.0252417 0.0847116 0.1345678 0.0580686 -0.0385169 -0.0467711 -0.0026766 0.0298739 0.0360227 0.0622179 -0.0817018 -0.0431403 0.0780135 0.6630847 -0.0623188 0.019347 -0.0748038 -0.0022942 -0.1560461 -0.0224634 -0.129443 0.2134196 0.9836396 0.2954549 -0.4705425 0.2817504 1.5984784 0.2379863 -0.6709319 0.0570027 0.7012295 0.6404378 0.4146205 -0.4017983 0.2660622 0.9401161 -0.0187947 -0.5893108 0.0217826 1.1224763 0.0053673 -0.0133446 0.0035771 -0.053253 0.0864452 0.0403026 -0.0006285 0.0081254 -0.0601397 0.0975049 -0.0049614 0.0809753 -0.0279475 0.0137404 -0.0424766 0.0867598 -0.0220551 0.0279504 0.0926491 -0.0244247 0.0643002 -0.0130663 -0.0000748 0.0824548 0.0112038 0.0835433 -0.007087 -0.0269096 0.0806104 0.0421125 0.0235416 0.0670447 0.0239363 0.0498084 -0.0158061 0.0721566 -0.0532968 -0.0790803 -0.0310232 -0.079558 -0.1189954 -0.0757397 -0.0318937 -0.0646565 0.053883 0.0346066 0.0108047 -0.0030575 0.0268874 0.0632383 -0.0093587 0.0255061 0.0537626 -0.122041 0.0164947 -0.0106369 0.0331703 0.0222656 0.0571861 0.012314 0.0377195 0.0180825 -0.1121853 0.2819801 -0.0449981 0.0684603 -0.1664924 0.0696748 -0.108914 0.1369152 -0.0571024 0.2362636 0.2633164 -0.0557226 -0.0442252 -0.0898936 0.2910795 0.0009434 0.0648741 -0.0176751 0.0698352 0.2368866 -0.0552662 0.1219892 -0.0105509 0.3148524 0.0173059 0.1615987 0.0561672 0.259106 0.429086 -0.1428003 -0.0273855 -0.0849724 0.319649 -0.0992526 0.0012284 -0.124807 0.1919966 unknown
polarizability: 102.8153214|9.3844273|96.3397375|-8.2545054|2.4567937|77.0509937 unknown
InChI: InChI=1S/C7H11NO4/c8-5(7(11)12)2-3-1-4(3)6(9)10/h3-5,9,11H,1-2,8H2
charge 0 multiplicity 1
23 atoms
O  -2.141989 -1.772493 -0.319372
O  -3.06373 -0.137652 1.055123
O  0.703359 -1.583315 0.654674
O  1.7504 -1.21923 -1.389185
N  3.404761 0.640878 0.011218
C  -0.426722 1.380848 0.334694
C  -1.323825 0.464676 -0.559344
C  -1.56478 1.985683 -0.470576
C  1.032374 1.585255 -0.052043
C  2.00913 0.438322 0.414814
C  -2.260642 -0.439314 0.14205
C  1.519074 -0.863858 -0.210393
H  -0.618211 1.264516 1.408561
H  -0.870512 0.058731 -1.467054
H  -1.321799 2.569083 -1.363755
H  -2.46174 2.301145 0.06933
H  1.399658 2.528426 0.400583
H  1.132702 1.69085 -1.150547
H  1.944405 0.342867 1.512971
H  3.83061 1.509622 0.341072
H  3.582956 0.434416 -0.976345
H  -2.811148 -2.329648 0.164114
H  0.213767 -2.296308 0.157009
