program: Gaussian 09
title: 000130923
version: EM64L-G09RevD.01
frameworkgroup: C1[X(C9H9FO4)]
method: RPBEPBE
basis: SDD
operation: Freq
keyword: #pfreq=noraman
keyword: PBEPBE/SDD
title: #p freq=noraman PBEPBE/SDD
converged: YES YES NO NO
title: Mulliken charges:
elementType: F O O O O C C C C C C C C C H H H H H H H H H
charge: -0.199999 -0.288359 -0.443348 -0.415834 -0.216781 0.375178 -0.640634 -0.489710 0.220065 0.212671 0.215407 -0.516369 0.203856 -0.522846 0.278667 0.264678 0.263381 0.246849 0.215190 0.231587 0.262625 0.365247 0.378481
chargesum: 0.00000
title: Mulliken charges with hydrogens summed into heavy atoms:
elementType: F O O O O C C C C C C C C C
charge: -0.199999 -0.288359 -0.078101 -0.037353 -0.216781 0.375178 -0.097290 -0.226329 0.220065 0.212671 0.215407 -0.269521 0.203856 0.186557
polarizability: 1.52689949e+02 2.39004391e+00 1.07359432e+02 -1.11105997e+01 7.62138226e+00 7.24590776e+01
1716.lowfreq: -4.7139 -0.3916 -0.0011 -0.0006 -0.0005 8.6024 18.9205 30.6568 60.9998
frequency: 18.6687 30.6311 60.9905 78.2340 105.6932 158.8325 205.4224 221.4194 251.0712 280.2423 295.3897 315.7892 325.1312 347.3282 400.5008 442.3405 465.5374 483.6893 519.1559 570.3980 596.5651 636.6139 662.5338 689.2136 716.7470 726.8467 812.7231 824.3139 854.0075 897.5453 924.2526 953.9506 1040.6883 1074.2312 1112.0264 1115.6896 1153.8526 1171.2822 1178.3305 1209.7155 1248.4074 1265.0831 1309.4566 1338.9286 1389.0960 1401.8911 1436.2075 1444.6221 1457.9033 1481.6371 1510.9323 1601.6912 1634.8810 1678.8501 2978.3686 3014.2359 3068.9540 3087.3798 3130.1007 3147.8009 3157.9029 3517.2679 3584.9236
redmass: 5.4474 11.8533 4.5987 3.5740 3.1010 1.6089 3.3589 4.7890 3.0830 7.4190 5.4734 4.5847 1.1714 6.8936 8.9603 3.9075 3.4017 2.2263 5.3613 4.6647 4.5682 1.4622 5.6115 7.3469 3.4299 5.0207 2.2016 2.6783 3.5138 1.6250 3.0594 3.6908 2.8444 4.0681 1.7298 1.3940 1.3502 1.3703 1.4516 1.9224 1.6013 1.3480 4.4649 2.3806 6.3301 3.1948 1.1281 1.3983 1.0584 1.0552 3.6858 7.2328 8.3631 8.5022 1.0342 1.0608 1.0992 1.0982 1.1046 1.0923 1.0923 1.0641 1.0662
irintensity: 0.0129 0.9949 6.6678 2.1507 0.3746 2.2679 1.6066 3.7398 1.9304 1.7340 6.7390 14.4990 128.6618 11.5052 1.7727 11.2953 4.8597 19.7808 40.7155 29.4485 9.5708 133.8234 11.4610 3.1133 8.7421 6.9266 12.8558 30.1779 3.0873 24.8264 18.7200 87.3477 400.2106 28.5545 54.4120 17.3036 44.5048 66.7764 47.5206 110.2821 1.7114 76.6498 76.4603 25.9487 3.5437 22.6555 33.8147 14.9529 14.7752 28.7393 180.0424 2.6453 34.9451 186.7546 77.1360 10.6923 0.9530 33.6259 16.5093 3.1455 1.5023 24.3111 44.0343
temp: 298.150 k
press: 1.00000 atm
elementType: 9 8 8 8 8 6 6 6 6 6 6 6 6 6 1 1 1 1 1 1 1 1 1
symmnumber: 1
zpe: 435525.1 jmol-1
zpe.correction: 0.165883 hartree
zpe.thermalcorrener: 0.179874 hartree
zpe.thermalcorrenthalpy: 0.180818 hartree
zpe.thermalcorrgfe: 0.123221 hartree
zpe.sumelectzpe: -748.037507 hartree
zpe.sumelectthermal: -748.023515 hartree
zpe.sumelectthermalent: -748.022571 hartree
zpe.sumelectthermalfe: -748.080168 hartree
dipole: -1.0668 0.4698 0.4215
dipole: 1.2395
quadrupole: -68.5946 -72.5053 -84.5385
quadrupole: -9.6239 -6.6731 0.3248
quadrupole: 6.6182 2.7075 -9.3257 -9.6239 -6.6731 0.3248
hfenergy: -748.2033893 hartree
pointgroup: C01 [X(C9H9F1O4)]
dipole: -0.4247269 -0.1275598 -0.2028728 debye
dipolederiv: -0.6384705 0.3998232 0.0234254 0.4404802 -0.6703181 -0.0642223 0.0528167 -0.0999333 -0.1598201 -1.0938362 0.6378669 -0.1169622 0.572503 -0.7633409 0.1435288 0.0083825 -0.0137806 -0.3449247 -1.2770821 -0.3244042 -0.2570788 -0.3231704 -0.2170327 0.0041508 -0.2923505 0.0097008 -0.4486817 -1.4050426 -0.1014528 -0.3475471 -0.1443171 -0.4335945 -0.0729844 -0.17723 -0.0358878 -0.3286546 -0.7238158 -0.0655365 -0.0008926 -0.0544922 -0.2960885 0.1012769 -0.1769347 0.0755892 -0.8985673 0.0702601 -0.0264053 -0.0191844 0.2244679 -0.1564314 0.0232166 0.0459193 -0.038121 -0.1052051 0.0113829 -0.0016758 0.0924748 -0.0154151 0.1159021 0.0606005 0.2859421 0.0935346 -0.15143 -0.0269278 0.1125215 0.0582413 -0.051391 -0.0152489 0.0616431 -0.0299056 0.1102281 -0.0936307 0.5388418 -0.5511541 -0.0588819 -0.8802309 0.6322701 -0.0901771 -0.3194661 0.1726067 -0.0610108 0.6271465 -0.2986242 0.0191766 -0.4508288 0.7346269 0.1098449 -0.08667 0.1793502 0.135364 1.0941731 0.261651 0.2698323 0.4976638 0.0801579 0.1302325 0.4361452 0.019152 0.1468859 -0.341178 -0.012151 -0.0221939 0.0604391 -0.1047288 0.0480808 0.0046251 0.0348746 -0.1686934 1.7222896 0.2054768 0.1803884 0.229131 0.2444735 -0.1243807 0.0790023 -0.1542987 1.186785 0.5924388 -0.2836274 0.107404 -0.1046018 0.3182032 -0.1312315 0.2694211 -0.286757 0.4075853 -0.0006182 0.0186543 -0.0262148 0.0528006 0.0324813 0.0707487 -0.027407 0.0235923 0.0936735 0.047257 -0.0070332 0.0288355 -0.0497801 0.0082018 -0.0976607 -0.0174791 -0.0595024 0.0574644 0.0980892 -0.0373229 -0.0349626 -0.0314068 -0.0042514 -0.0605518 -0.0268287 -0.0629893 0.1213289 0.0552865 -0.0523096 -0.047669 -0.0322209 -0.0020296 -0.0740694 -0.0519507 -0.0835048 0.1520449 -0.0372027 -0.0432903 0.11341 -0.0059414 0.0391412 0.0689321 -0.0327953 0.1677351 -0.1112738 0.0077375 0.1228423 0.0131949 0.1557684 -0.0608553 -0.0396884 0.0354425 -0.0639061 0.0528739 0.0023679 -0.04762 -0.0586918 -0.1403468 0.0444846 -0.0432876 -0.0964053 0.0217882 0.0384421 0.3759609 0.1199207 0.0291162 0.0736296 0.102846 -0.0732821 0.0181041 -0.0653517 0.3634189 0.3009423 -0.0261492 0.0547798 -0.0227402 0.3711314 0.0492806 0.0996221 0.055881 0.1160254 unknown
polarizability: 150.6639648|-8.1029775|106.1384235|14.7006902|10.1274631|75.7060695 unknown
InChI: InChI=1S/C9H9FO4/c1-14-8-2-5(3-9(12)13)6(10)4-7(8)11/h2,4,11-12H,3H2,1H3
charge 0 multiplicity 1
23 atoms
F  1.343155 -2.329037 -0.158768
O  -2.488948 1.708851 0.544793
O  -3.267367 -0.804633 -0.622618
O  4.443795 0.632596 0.287078
O  2.832016 0.618718 -1.385941
C  0.7691 -0.087203 0.564054
C  2.200537 0.154561 0.984882
C  -0.23604 0.898568 0.690159
C  -1.570941 0.679761 0.28423
C  0.373596 -1.311748 -0.005916
C  -1.923933 -0.587393 -0.268049
C  -0.936175 -1.58612 -0.423104
C  3.128003 0.482049 -0.183115
C  -3.375594 2.136168 -0.560392
H  2.628179 -0.727374 1.495784
H  2.266784 0.991589 1.703263
H  0.000946 1.879196 1.115098
H  -1.173813 -2.567432 -0.8492
H  -2.773862 2.489763 -1.419704
H  -3.959017 2.970708 -0.143227
H  -4.040284 1.315714 -0.874794
H  -3.39901 -1.727963 -0.951826
H  5.041773 0.845359 -0.479887
