program: Gaussian 09
title: 000130891
version: EM64L-G09RevD.01
frameworkgroup: C1[X(C13H16O4)]
method: RPBEPBE
basis: SDD
operation: Freq
keyword: #pfreq=noraman
keyword: PBEPBE/SDD
title: #p freq=noraman PBEPBE/SDD
converged: YES YES NO NO
title: Mulliken charges:
elementType: O O O O C C C C C C C C C C C C C H H H H H H H H H H H H H H H H
charge: -0.302216 -0.271912 -0.211953 -0.252020 -0.094837 -0.061073 -0.702649 -0.706322 0.211027 0.228022 0.213250 -0.339954 -0.334767 -0.500077 -0.222024 -0.219021 -0.221678 0.229472 0.272005 0.233232 0.215869 0.213982 0.211162 0.227545 0.229803 0.269296 0.264437 0.233548 0.231119 0.240375 0.249545 0.234509 0.232307
chargesum: 0.00000
title: Mulliken charges with hydrogens summed into heavy atoms:
elementType: O O O O C C C C C C C C C C C C C
charge: -0.302216 -0.271912 -0.211953 -0.252020 0.134635 0.210932 -0.039566 -0.037813 0.211027 0.228022 0.213250 -0.070658 -0.070330 0.224352 0.011524 0.012098 0.010628
polarizability: 2.04956482e+02 7.41598524e-01 1.39133935e+02 1.16942103e+01 -1.77796901e+01 1.14507443e+02
1716.lowfreq: -6.2718 -4.6245 0.0007 0.0008 0.0008 8.9719 21.8210 35.1232 40.4597
frequency: 21.7589 35.1113 40.4135 59.2962 75.1161 78.7554 91.1303 105.6904 158.6150 167.9781 183.3552 192.1581 221.3939 236.8373 257.5463 304.1231 313.1847 335.8755 395.8464 402.9657 424.9941 446.6145 465.1314 584.6448 613.8175 622.2897 661.7119 678.3050 700.4803 719.2571 792.3574 795.6652 839.2373 862.0234 863.8175 902.6441 923.5995 953.7375 959.3295 974.9131 990.5112 993.5275 994.8518 1008.2807 1019.4679 1050.7462 1086.7535 1103.1296 1114.4550 1129.1053 1149.3022 1152.7348 1174.0865 1182.4257 1190.8420 1232.9271 1262.8521 1308.9274 1316.0050 1321.7520 1339.0812 1380.1669 1390.1360 1398.9106 1422.7025 1437.9398 1453.0312 1464.0436 1464.9698 1471.5888 1478.1819 1480.7949 1489.1077 1585.5941 1611.8348 1625.9280 1661.0472 2980.5021 2986.0881 3001.6539 3006.4042 3027.9741 3073.6477 3079.4675 3085.7790 3092.2835 3109.6708 3130.0872 3143.1246 3152.0657 3155.4149 3167.7125 3180.4270
redmass: 4.6497 4.6214 4.5228 2.6309 4.2370 3.5321 1.4172 2.8601 4.7487 3.2185 1.4172 2.8671 2.2505 1.3505 4.7781 3.7828 6.1797 5.0406 2.5780 2.8190 5.7275 4.1993 4.2819 5.0182 6.4418 4.3023 6.7547 5.1258 1.6212 5.5799 5.0245 2.2427 3.7753 4.2686 1.3047 3.8990 1.1979 1.4240 1.6252 3.4943 5.2189 2.2914 1.3951 1.3311 2.9766 3.0072 1.7005 1.9786 1.2819 2.9901 1.4658 2.5666 1.0568 1.1611 1.8604 1.8712 2.1935 1.4373 1.3172 1.5031 1.4165 1.2088 9.9425 1.2068 1.1746 2.2443 1.0497 1.0494 1.0446 1.0521 2.2853 1.0465 1.0571 6.6939 6.1277 10.8278 10.1966 1.0357 1.0360 1.0831 1.0295 1.0836 1.0997 1.0991 1.1003 1.0993 1.1047 1.0855 1.0892 1.1050 1.0940 1.0982 1.0973
irintensity: 1.3649 1.5125 1.3614 0.2173 0.4950 1.1090 0.2503 0.4700 0.9390 0.8823 1.3192 1.6883 3.3506 1.0243 11.0308 11.7257 5.8941 8.7366 4.9765 0.0201 4.1513 1.3376 2.5700 3.4552 0.5357 9.1782 8.7755 15.7676 81.2634 23.4389 3.9203 19.3211 6.1453 2.7925 0.3290 9.2387 5.4126 3.2170 3.4803 35.2526 6.8195 24.4638 0.6530 0.2405 134.2189 269.1386 34.7619 94.5547 5.5615 114.1737 20.7996 115.7402 0.1170 32.2413 12.3643 141.7195 145.3575 32.5345 1.0683 6.6344 11.0440 19.9459 2.6138 18.1967 15.1441 16.7044 14.2734 13.3217 2.2864 2.3415 6.0246 12.6421 14.1797 32.9712 10.5099 192.9488 130.8221 33.8330 18.9190 8.8224 32.8965 7.8926 21.4785 50.2615 2.3875 69.3871 23.0460 0.3287 11.0400 15.6539 16.6179 22.5029 7.5263
temp: 298.150 k
press: 1.00000 atm
elementType: 8 8 8 8 6 6 6 6 6 6 6 6 6 6 6 6 6 1 1 1 1 1 1 1 1 1 1 1 1 1 1 1 1
symmnumber: 1
zpe: 692468.9 jmol-1
zpe.correction: 0.263747 hartree
zpe.thermalcorrener: 0.281659 hartree
zpe.thermalcorrenthalpy: 0.282604 hartree
zpe.thermalcorrgfe: 0.215635 hartree
zpe.sumelectzpe: -804.610923 hartree
zpe.sumelectthermal: -804.593011 hartree
zpe.sumelectthermalent: -804.592067 hartree
zpe.sumelectthermalfe: -804.659035 hartree
dipole: 0.7529 1.7226 -0.2971
dipole: 1.9033
quadrupole: -73.5156 -96.5961 -104.4318
quadrupole: -2.9133 0.7205 -1.6914
quadrupole: 17.9989 -5.0816 -12.9173 -2.9133 0.7205 -1.6914
hfenergy: -804.8746704 hartree
pointgroup: C01 [X(C13H16O4)]
dipole: -0.3057916 -0.6685934 -0.1421977 debye
polarizability: 205.270758|-0.2991187|137.9826089|-10.1099975|18.7078865|115.3444921 unknown
InChI: InChI=1S/C13H16O4/c1-9(2)11(13(15)16-3)17-12(14)10-7-5-4-6-8-10/h4-9,11H,1-3H3
charge 0 multiplicity 1
33 atoms
O  -0.299275 -0.549484 0.164486
O  -3.576203 1.087173 0.152865
O  -1.757136 1.372314 -1.279505
O  0.203598 1.3274 1.454157
C  -2.448318 -1.714706 0.260071
C  -1.721788 -0.36729 0.512112
C  -1.897774 -2.802748 1.210174
C  -2.363265 -2.154814 -1.219669
C  -2.298839 0.786623 -0.322094
C  0.586186 0.408513 0.689767
C  1.988658 0.173976 0.249173
C  2.997886 1.028756 0.764485
C  2.331397 -0.860345 -0.660059
C  -4.273723 2.196841 -0.543519
C  4.340771 0.847131 0.377135
C  3.676837 -1.037379 -1.045294
C  4.682729 -0.186751 -0.527566
H  -3.509728 -1.523906 0.515162
H  -1.801523 -0.080683 1.577593
H  -0.830955 -2.998913 1.003132
H  -2.454611 -3.74741 1.073466
H  -1.992449 -2.502037 2.270331
H  -2.909503 -3.104087 -1.365125
H  -2.801301 -1.402584 -1.900739
H  -1.312342 -2.310066 -1.520575
H  2.70754 1.823378 1.459706
H  1.543343 -1.505431 -1.057598
H  5.118663 1.507495 0.775111
H  3.942506 -1.833619 -1.749016
H  -4.401681 1.957027 -1.612435
H  -3.689804 3.127095 -0.446703
H  -5.243887 2.280932 -0.0348
H  5.726789 -0.326799 -0.829628
