program: Gaussian 09
title: 000130860
version: EM64L-G09RevD.01
frameworkgroup: C1[X(C11H12BrNO5S)]
method: RPBEPBE
basis: SDD
operation: Freq
keyword: #p
keyword: freq=noraman
keyword: PBEPBE/SDD
title: #p freq=noraman PBEPBE/SDD
converged: YES YES NO NO
title: Mulliken charges:
elementType: Br S O O O O O N C C C C C C C C C C C H H H H H H H H H H H H
charge: 0.029257 0.231520 -0.393719 -0.451727 -0.233532 -0.427557 -0.287129 -0.389036 -0.103752 -0.702546 -0.298849 0.183495 0.466997 -0.387548 0.264732 0.328843 -0.332237 -0.359666 -0.769894 0.300152 0.285175 0.295181 0.386030 0.259018 0.281216 0.253489 0.252807 0.211582 0.383466 0.360156 0.364079
chargesum: 0.00000
title: Mulliken charges with hydrogens summed into heavy atoms:
elementType: Br S O O O O O N C C C C C C C C C C C
charge: 0.029257 0.231520 -0.010254 -0.091571 -0.233532 -0.063478 -0.287129 -0.003006 0.196400 -0.122190 -0.298849 0.183495 0.466997 -0.128530 0.264732 0.328843 -0.332237 -0.078450 -0.052017
polarizability: 2.12075965e+02 -1.65439423e+01 1.97595082e+02 1.42482582e+01 1.33516462e+01 1.27827386e+02
1716.lowfreq: -8.9759 -3.8728 -0.0014 -0.0009 0.0009 2.1319 16.0578 27.0700 36.3741
frequency: 15.8507 27.0355 36.3459 44.3617 53.7610 66.6450 78.6274 90.3249 112.4838 139.3579 166.4515 171.9768 190.9894 216.9179 228.3755 266.2976 274.4397 326.9140 331.2317 344.7582 356.0218 370.8322 407.3914 430.2878 450.9953 464.9233 509.2867 515.7725 518.3319 548.7915 579.2803 588.2681 603.7437 623.9829 645.5968 703.0493 710.2600 726.8569 752.1140 780.0089 798.3247 859.1647 862.2776 898.0506 913.0239 951.9251 989.6033 1010.4391 1030.2812 1042.8465 1079.2745 1134.2179 1136.7495 1144.3267 1198.0800 1212.3247 1232.1086 1240.0826 1279.1442 1291.2595 1295.6003 1302.7215 1329.9858 1378.5521 1384.1076 1402.6911 1410.8925 1449.9517 1461.3079 1466.5822 1511.5594 1572.7446 1604.6611 1615.2588 1647.3253 2922.9445 2997.0594 3052.6289 3091.7978 3111.4185 3136.8528 3139.1416 3189.5654 3415.3335 3476.2190 3511.5215 3588.3182
redmass: 7.1228 7.2180 11.4018 11.2211 2.4359 1.5470 5.6482 4.4025 4.7308 9.4285 10.4314 6.9587 6.2047 6.4035 8.1119 6.8834 4.1877 5.5438 1.1489 3.7331 4.6746 5.4286 4.9210 1.2935 2.8426 9.2202 4.3547 4.3301 4.1977 4.4784 3.6357 3.5199 3.2771 4.3852 1.6203 4.2651 5.1921 8.0274 6.8590 1.2264 2.5237 1.5649 1.3813 8.2718 2.6415 4.9919 1.7896 2.2972 3.1188 1.6576 1.9565 1.5903 1.8799 1.3828 1.8228 1.5348 1.3811 1.6098 1.9388 2.8464 1.4150 1.6045 2.1771 4.5806 1.2431 3.6121 1.1183 1.0660 3.2862 1.1154 1.8235 6.9257 7.2867 4.6790 9.2405 1.0786 1.0361 1.0575 1.0987 1.0997 1.1085 1.0923 1.0934 1.0821 1.0647 1.0639 1.0663
irintensity: 0.4307 1.1536 1.6388 1.1298 0.5399 2.3434 3.7994 4.5667 3.5164 2.8830 0.9980 0.3425 5.2519 0.8635 6.8544 1.7243 2.3176 6.3114 146.1606 1.7646 4.9737 4.4191 15.3645 99.7304 33.4461 4.3389 25.9133 16.4052 21.7192 1.5581 7.0832 41.5743 30.4653 0.8719 91.8529 38.9580 9.2011 44.7889 48.7270 163.5248 33.0323 33.2755 5.1677 34.4680 23.6980 20.3304 25.7384 51.7476 8.3523 6.7325 167.6720 374.5384 10.4200 5.7232 17.9317 22.2561 9.4116 21.3042 33.0867 41.1856 38.9609 80.3149 24.2950 106.6048 55.7369 80.8352 40.2099 28.0474 60.4873 35.5120 200.5106 26.5866 67.4062 162.4734 231.3391 53.3529 8.9420 8.1528 16.9991 13.6958 1.2961 4.3068 0.8905 275.0421 64.7861 32.1532 55.7451
temp: 298.150 k
press: 1.00000 atm
elementType: 35 16 8 8 8 8 8 7 6 6 6 6 6 6 6 6 6 6 6 1 1 1 1 1 1 1 1 1 1 1 1
symmnumber: 1
zpe: 575638.2 jmol-1
zpe.correction: 0.219249 hartree
zpe.thermalcorrener: 0.239686 hartree
zpe.thermalcorrenthalpy: 0.240631 hartree
zpe.thermalcorrgfe: 0.166560 hartree
zpe.sumelectzpe: -1267.354529 hartree
zpe.sumelectthermal: -1267.334092 hartree
zpe.sumelectthermalent: -1267.333147 hartree
zpe.sumelectthermalfe: -1267.407218 hartree
dipole: 3.3131 0.5255 -1.2263
dipole: 3.5716
quadrupole: -139.7878 -113.5430 -134.3766
quadrupole: 2.5068 8.7254 17.4460
quadrupole: -10.5520 15.6928 -5.1408 2.5068 8.7254 17.4460
hfenergy: -1267.5737781 hartree
pointgroup: C01 [X(C11H12Br1N1O5S1)]
dipole: 1.2896426 -0.5573 -0.0277311 debye
polarizability: 210.3486493|12.797592|124.5376468|15.6494151|-4.7229128|202.6121367 unknown
InChI: InChI=1S/C11H12BrNO5S/c1-5(14)13-8(11(17)18)4-19-9-3-6(15)2-7(12)10(9)16/h2-3,8,13,15-17H,4H2,1H3
charge 0 multiplicity 1
31 atoms
Br 3.455881 -0.663708 2.410646
S  -0.546522 -1.217696 -1.68762
O  -3.762855 -1.089526 1.061725
O  0.639285 -1.325984 1.154224
O  -4.032538 -1.159423 -1.241257
O  4.199527 0.932259 -2.597206
O  -2.491965 2.64534 1.466317
N  -1.613152 0.563224 0.917951
C  -2.433645 0.459174 -0.280556
C  -1.613726 0.36878 -1.58159
C  1.098346 -0.605391 -1.125812
C  -3.469323 -0.673604 -0.235129
C  1.530893 -0.785997 0.21439
C  1.975441 -0.033564 -2.075249
C  -1.717301 1.674561 1.740332
C  3.281911 0.36057 -1.703826
C  2.851496 -0.391421 0.554559
C  3.733308 0.17464 -0.37694
C  -0.856142 1.649249 2.996046
H  -3.015927 1.410536 -0.308815
H  -0.938706 1.232742 -1.675603
H  -2.284189 0.304398 -2.452854
H  -0.979203 -0.213492 1.151491
H  1.625754 0.075224 -3.10839
H  4.748662 0.471861 -0.106217
H  -0.369389 2.630316 3.120816
H  -1.506526 1.488993 3.874638
H  -0.086472 0.858971 2.975768
H  -4.467889 -1.792114 1.022482
H  1.124609 -1.551451 1.993194
H  3.813158 1.017433 -3.503715
