program: Gaussian 09
title: 000131275
version: EM64L-G09RevD.01
frameworkgroup: C1[X(C25H26ClN2O2S)]
method: RPBEPBE
basis: SDD
operation: Freq
keyword: #p
keyword: freq=noraman
keyword: PBEPBE/SDD
title: #p freq=noraman PBEPBE/SDD
converged: YES YES NO NO
title: Mulliken charges:
elementType: Cl S O O N N C C C C C C C C C C C C C C C C C C C C C C C C C H H H H H H H H H H H H H H H H H H H H H H H H H H
charge: -0.036425 0.228088 -0.303174 -0.227728 -0.128146 -0.317702 -0.297667 -0.466478 -0.254011 -0.461588 -0.543974 -0.561659 0.548505 0.471605 -0.401546 -0.335440 -0.279449 -0.337542 0.205109 -0.249853 -0.256285 -0.134442 -0.228255 -0.238116 -0.241451 0.251293 -0.298686 -0.335622 -0.228400 -0.209576 -0.206652 0.305957 0.262880 0.306554 0.224744 0.297254 0.269736 0.246015 0.244604 0.294908 0.262361 0.253248 0.261735 0.270744 0.269236 0.270914 0.248108 0.264002 0.260108 0.243926 0.265451 0.249275 0.281545 0.258733 0.259588 0.249197 0.254445
chargesum: 1.00000
title: Mulliken charges with hydrogens summed into heavy atoms:
elementType: Cl S O O N N C C C C C C C C C C C C C C C C C C C C C C C C C
charge: -0.036425 0.228088 -0.303174 -0.227728 -0.128146 -0.317702 0.271170 0.064820 0.312978 0.029032 0.266543 0.240055 0.548505 0.471605 -0.401546 -0.335440 -0.008535 -0.089435 0.205109 0.014149 0.003823 -0.134442 0.015671 0.027335 0.007824 0.251293 -0.017141 -0.076888 0.031189 0.039621 0.047793
polarizability: 3.72565913e+02 6.59762602e+01 2.58144842e+02 5.35267789e-01 -1.30169980e+01 2.94846030e+02
1716.lowfreq: -13.9253 -7.8996 -4.7785 -0.0019 -0.0018 -0.0016 2.6267 15.2500 24.2746
frequency: -4.1150 14.3877 23.9639 33.1073 40.4124 51.3707 53.2854 73.7248 84.7222 94.0552 110.8985 125.4771 135.4113 148.5687 162.7800 167.9363 179.0921 211.2878 216.5420 233.4302 242.6644 245.9865 259.1433 273.8611 295.4726 305.7460 325.6931 342.5370 349.3777 361.8242 385.6755 397.8395 410.2933 414.7005 425.2670 431.7195 438.5094 444.0983 461.1241 472.9138 494.9891 521.8732 539.1127 548.1141 570.4174 587.2440 611.1319 615.7058 645.5055 664.3809 671.5314 680.2683 694.6215 709.1550 713.3597 726.3557 729.3674 759.5666 761.5008 795.3131 799.4356 813.3018 846.6822 848.9779 857.6653 861.7604 869.3311 887.4308 925.1899 937.5114 939.7748 945.6246 947.0428 961.1501 979.4791 986.1735 988.8208 999.6040 1018.9329 1020.2754 1025.3860 1025.5380 1030.8771 1038.7137 1045.6119 1064.6592 1081.6019 1093.5235 1096.5914 1102.8136 1116.1251 1127.9921 1142.3988 1149.4369 1178.9438 1182.6977 1185.9593 1189.8365 1203.2330 1226.1964 1233.2431 1235.9869 1251.6237 1259.6621 1281.0168 1295.7916 1307.7200 1322.2375 1322.4508 1340.3534 1359.2532 1369.5286 1374.1837 1378.2523 1384.6728 1395.8472 1405.3554 1420.6035 1430.1879 1437.1342 1440.8872 1446.1097 1450.3772 1455.7979 1463.9748 1468.5340 1471.1405 1477.2384 1479.5761 1480.9546 1488.0319 1495.7272 1561.2354 1578.9817 1580.0116 1581.2214 1604.9973 1608.1560 1664.6384 2971.1623 3008.6068 3023.8717 3026.5081 3028.4860 3030.4659 3060.7326 3079.4705 3103.2952 3108.4354 3137.8860 3139.2489 3142.8215 3145.1521 3148.6661 3151.6180 3154.2482 3156.1994 3158.5662 3160.5768 3163.8461 3169.6856 3174.5890 3177.5105 3184.4361 3184.6076
redmass: 6.2922 6.3814 5.9216 7.0324 6.4011 5.2294 5.2673 3.9905 5.7900 5.6109 4.1556 5.0673 3.0841 2.2559 2.9863 4.1241 2.1804 6.0112 2.2108 1.3863 3.1917 2.7144 3.8830 6.2390 5.2264 4.1112 3.6279 6.4708 2.4121 6.5541 3.2810 2.7961 4.7233 4.5739 4.4590 3.7587 3.2021 3.7259 3.4159 4.9617 3.3197 3.8888 4.0377 4.4947 6.6867 4.5857 6.4525 5.3972 6.5354 6.2295 5.3322 5.8676 1.6733 3.8654 3.8630 3.7564 2.6953 2.5465 1.7839 2.1906 2.4959 1.3269 1.9607 1.5959 1.4632 1.2533 2.6837 3.4772 2.5641 5.3332 1.5888 2.2436 1.3673 1.3951 2.3416 1.3338 5.8470 1.4012 5.1049 1.4102 2.4161 3.6139 4.8095 2.2418 1.6190 2.2646 2.0635 1.5754 3.5367 1.6418 1.7845 1.6125 1.5040 1.7393 1.0613 1.0611 1.4632 1.1575 1.5125 1.6138 3.0402 1.9353 1.3248 1.5782 2.0816 1.2820 1.7099 1.3210 1.3482 1.1972 1.4108 7.0118 1.2616 9.3917 1.2840 9.1879 2.6140 1.1585 2.2535 1.1342 2.2581 1.0874 2.3871 1.1532 1.0625 1.0550 2.4059 2.1811 1.0801 1.0706 1.1334 1.0665 6.8227 7.1599 5.9522 6.9380 7.3576 5.9381 11.2283 1.0680 1.0611 1.0528 1.0418 1.0438 1.0437 1.0968 1.0988 1.1109 1.1062 1.0871 1.1052 1.1049 1.0868 1.0891 1.1045 1.0893 1.0900 1.0947 1.1048 1.0938 1.0919 1.0975 1.1007 1.0996 1.0964
irintensity: 1.0113 0.7799 0.5191 0.5465 0.0791 2.0845 2.5420 1.3778 3.5708 2.2089 3.6272 0.1847 1.0145 1.2068 0.6959 2.7791 0.0104 0.8112 0.2118 0.6722 0.9304 4.7609 6.6551 3.4008 1.9094 5.0887 0.8131 5.5209 4.0780 2.4780 3.8746 0.2249 2.4475 1.3774 2.5001 0.2741 1.3937 7.6646 1.3035 17.3545 6.8136 2.5935 6.1016 2.1959 7.6328 1.1226 3.1617 0.7661 4.7831 7.6234 8.8544 1.5301 107.4584 25.1311 31.2894 9.4997 18.2952 95.2381 26.9156 79.0960 46.5950 38.1874 4.2724 51.6489 5.3276 1.6812 133.6051 48.4176 14.0027 84.9318 0.8705 3.8790 0.2493 5.0459 31.1655 0.1321 11.3797 0.9815 12.5666 1.0287 45.4621 148.1633 24.5968 17.7719 31.8773 1.4563 29.6183 7.4860 17.1875 12.1905 12.3870 15.3391 11.3753 8.0683 0.3047 3.8711 21.9229 23.3437 0.9374 64.3504 92.2059 77.4893 10.6519 24.9098 8.6416 6.7550 39.6970 2.2508 23.4904 10.7335 4.9190 10.5875 22.3132 3.4554 1.3388 3.8726 27.5535 14.8248 5.4330 9.9446 20.1311 6.9525 242.4112 58.4150 17.1521 27.8146 33.0241 2.6323 27.3295 21.3048 10.7797 76.6068 28.3293 19.7792 14.4186 37.6262 14.5933 59.4091 256.4410 34.3666 21.9529 22.8660 0.4864 9.5213 18.9473 5.3203 9.9924 4.3406 3.2354 5.2070 0.1533 10.4282 0.2236 1.7664 2.6646 3.1464 0.5715 9.6438 1.3169 3.9721 1.0823 7.9731 12.9896 6.2593 1.0432
temp: 298.150 k
press: 1.00000 atm
elementType: 17 16 8 8 7 7 6 6 6 6 6 6 6 6 6 6 6 6 6 6 6 6 6 6 6 6 6 6 6 6 6 1 1 1 1 1 1 1 1 1 1 1 1 1 1 1 1 1 1 1 1 1 1 1 1 1 1
symmnumber: 1
zpe: 1195189.6 jmol-1
zpe.correction: 0.455224 hartree
zpe.thermalcorrener: 0.483311 hartree
zpe.thermalcorrenthalpy: 0.484255 hartree
zpe.thermalcorrgfe: 0.395632 hartree
zpe.sumelectzpe: -2083.858218 hartree
zpe.sumelectthermal: -2083.830131 hartree
zpe.sumelectthermalent: -2083.829187 hartree
zpe.sumelectthermalfe: -2083.917810 hartree
dipole: 0.5973 12.5473 1.2081
dipole: 12.6195
quadrupole: -145.0940 -129.4893 -175.6228
quadrupole: 12.2307 -17.3277 -10.5286
quadrupole: 4.9747 20.5794 -25.5541 12.2307 -17.3277 -10.5286
hfenergy: -2084.313442 hartree
pointgroup: C01 [X(C25H26Cl1N2O2S1)]
dipole: -0.0462579 -4.4316417 -2.237991 debye
polarizability: 365.1112521|-65.3520005|275.3342357|-30.9402013|-16.7855898|285.1112973 unknown
InChI: InChI=1S/C25H26ClN2O2S/c1-28(2,18-30-25(29)19-9-4-3-5-10-19)16-8-15-27-21-11-6-7-12-23(21)31-24-14-13-20(26)17-22(24)27/h3-7,9-14,17H,8,15-16,18H2,1-2H3
charge 1 multiplicity 1
57 atoms
Cl -1.664585 1.890176 3.682281
S  1.785584 1.578871 -1.750195
O  -2.108661 -2.1114 -0.923203
O  -2.295217 -1.599685 1.36504
N  -0.009078 -3.350863 -1.107838
N  2.237169 -0.078241 0.739567
C  0.877526 -2.238462 -0.48584
C  0.99067 -2.24366 1.049753
C  -1.457866 -3.332248 -0.556601
C  2.20489 -1.361256 1.467703
C  -0.049582 -3.123286 -2.620605
C  0.566214 -4.734871 -0.82359
C  1.162754 0.852322 0.890947
C  3.469129 0.36619 0.142772
C  0.87292 1.761917 -0.165441
C  3.429191 1.184678 -1.016578
C  0.382121 0.909408 2.074942
C  4.734368 0.030211 0.690492
C  -2.586449 -1.280501 0.195673
C  -0.132717 2.737296 -0.025666
C  4.610641 1.655584 -1.621003
C  -0.651438 1.858816 2.168114
C  5.922181 0.465768 0.062361
C  -0.921215 2.788131 1.14697
C  5.866659 1.277561 -1.092532
C  -3.399131 -0.151439 -0.271746
C  -3.928309 0.724722 0.718889
C  -3.676633 0.072942 -1.649319
C  -4.730543 1.813376 0.330196
C  -4.477079 1.167847 -2.027724
C  -5.005647 2.036754 -1.041121
H  0.467684 -1.279735 -0.841741
H  1.86963 -2.368757 -0.954102
H  0.060649 -1.868037 1.507841
H  1.181422 -3.255106 1.455937
H  -1.411763 -3.452667 0.539568
H  -1.977303 -4.174811 -1.042813
H  2.196859 -1.235171 2.569361
H  3.134052 -1.898976 1.214742
H  -0.500504 -2.1406 -2.815404
H  0.979062 -3.154828 -3.010183
H  -0.65649 -3.914282 -3.088213
H  -0.019563 -5.489565 -1.371101
H  1.611944 -4.759693 -1.165349
H  0.522255 -4.944105 0.254654
H  0.584935 0.245402 2.918868
H  4.798677 -0.54376 1.620757
H  -0.316038 3.449555 -0.835879
H  4.549587 2.304512 -2.500539
H  6.890287 0.191526 0.493832
H  -1.717523 3.528428 1.255681
H  6.787084 1.628032 -1.569085
H  -3.705021 0.53849 1.774419
H  -3.278251 -0.610202 -2.40392
H  -5.144593 2.48319 1.09011
H  -4.698068 1.343618 -3.085188
H  -5.633978 2.882286 -1.340854
