program: Gaussian 09
title: 000130834
version: EM64L-G09RevD.01
frameworkgroup: C1[X(C14H19NO4S)]
method: RPBEPBE
basis: SDD
operation: Freq
keyword: #p
keyword: freq=noraman
keyword: PBEPBE/SDD
title: #p freq=noraman PBEPBE/SDD
converged: YES YES NO NO
title: Mulliken charges:
elementType: S O O O O N C C C C C C C C C C C C C C H H H H H H H H H H H H H H H H H H H
charge: 0.192732 -0.434355 -0.435787 -0.209240 -0.309412 -0.366088 -0.611150 -0.367207 0.502058 -0.722779 -0.101228 -0.326207 -0.436122 -0.380454 0.169810 -0.222939 -0.235699 -0.242561 0.310443 -0.773291 0.317356 0.206493 0.230159 0.262984 0.275502 0.296259 0.219462 0.211500 0.284960 0.234726 0.327093 0.226655 0.223834 0.227612 0.331115 0.262404 0.254606 0.214216 0.392541
chargesum: 0.00000
title: Mulliken charges with hydrogens summed into heavy atoms:
elementType: S O O O O N C C C C C C C C C C C C C C
charge: 0.192732 -0.103240 -0.043246 -0.209240 -0.309412 -0.038995 -0.293794 0.069445 0.502058 -0.184293 0.195031 0.104755 -0.151162 -0.145728 0.169810 0.003716 -0.011866 -0.014948 0.310443 -0.042066
polarizability: 2.43079779e+02 2.18520327e+01 1.85476601e+02 1.83134782e+00 1.17586976e+01 1.43456479e+02
1716.lowfreq: -12.0872 -7.4947 -0.0011 -0.0005 -0.0004 2.0434 20.9470 25.9110 33.7252
frequency: 20.5018 25.6623 33.4866 37.5676 46.2127 59.9615 65.2866 76.4760 84.3303 91.2041 104.0543 129.6460 135.5161 161.9357 189.6063 218.9431 241.8894 278.6997 296.2131 308.5803 321.6064 326.7890 354.2221 403.9400 408.6618 476.9525 515.6544 519.2914 548.0774 569.4549 576.2240 587.8358 596.5142 605.1081 615.4810 657.3512 680.7936 706.1626 740.4966 756.3601 786.5920 820.7153 831.3849 855.3567 857.1304 931.9688 932.5051 956.7909 980.7977 982.4575 987.9394 996.9831 1000.9137 1011.4049 1029.6907 1036.5259 1042.3315 1058.3989 1079.3753 1086.3862 1112.9001 1137.7506 1171.6652 1189.7303 1192.5563 1208.5945 1214.7033 1244.3591 1260.0900 1270.2201 1281.8447 1288.5598 1303.2304 1303.7375 1329.6707 1337.7225 1356.9815 1379.6186 1388.1174 1389.0053 1429.5416 1444.7304 1449.2389 1463.0075 1467.0031 1480.0486 1483.1431 1490.8763 1591.4088 1606.8498 1610.7862 1668.2694 2979.3510 2988.9252 2997.8352 3017.9622 3028.7117 3047.7930 3054.0727 3081.2230 3092.1178 3093.3990 3111.5229 3118.1805 3124.2171 3135.3049 3144.8308 3161.3722 3524.0096 3559.8831 3565.5941
redmass: 5.6606 5.7249 4.1793 8.6043 5.0437 2.6359 3.9765 1.9119 1.4907 4.3262 6.3957 5.6723 5.4534 5.3609 3.5082 3.2030 4.0644 5.9118 4.8796 1.4558 4.1406 3.0783 4.3744 2.8334 3.1982 3.8507 3.6007 3.5408 2.1326 3.6265 2.0986 2.4515 1.8374 3.2538 6.3129 2.5281 4.8284 1.5704 6.0226 2.3674 2.0693 1.5291 1.9791 4.4995 1.2874 1.7120 3.4832 3.8683 2.2594 1.3943 5.3104 1.8781 1.3537 2.6243 2.5246 2.5050 1.6476 2.1651 2.2357 1.5573 2.3060 1.2878 1.0594 1.1531 1.4342 1.8399 1.2743 1.2180 1.6704 1.3225 1.2940 1.7360 1.4148 1.5371 1.3693 1.2673 1.4806 1.2458 1.2880 3.4785 1.0924 2.0723 1.0631 1.0888 1.1041 1.1032 2.1786 1.9487 5.9032 5.9212 5.9440 9.2894 1.0654 1.0618 1.0363 1.0577 1.0865 1.0969 1.0838 1.1012 1.1054 1.0990 1.0997 1.0850 1.0877 1.0924 1.0965 1.1016 1.0643 1.0662 1.0780
irintensity: 0.2702 1.5632 0.3620 1.8039 0.4307 1.9861 0.1487 6.0948 1.9244 5.4971 15.6572 4.7438 1.1344 6.6062 0.9550 3.2380 0.8797 4.9292 3.9401 79.0977 10.8411 62.7823 2.1337 0.1410 4.9275 0.6696 16.1732 17.4427 8.1163 0.3480 52.8514 163.9566 68.0685 12.7684 1.1712 82.3933 22.5645 84.1171 7.9963 2.5575 14.3986 14.7892 2.1546 34.8044 0.2476 12.2605 19.6301 96.2978 13.2987 2.4634 0.3281 6.8030 1.8143 12.2378 13.0645 10.0919 12.0229 22.3870 259.1755 7.5063 19.0334 18.4670 0.0338 0.6888 8.2548 10.8238 1.4387 3.6075 28.8889 24.4620 7.0310 64.8197 12.4333 22.8583 11.2253 11.2880 3.7974 20.2664 52.4349 7.5873 31.0323 7.2807 22.7187 11.7026 40.6818 8.2775 20.0014 153.4442 3.2220 170.6798 2.4711 250.6576 34.0364 32.4204 9.1898 18.6222 9.6620 11.1420 5.7830 36.5846 7.6869 15.5913 10.4891 4.1804 3.4827 12.5572 26.3688 34.5555 40.5175 8.3014 40.8382
temp: 298.150 k
press: 1.00000 atm
elementType: 16 8 8 8 8 7 6 6 6 6 6 6 6 6 6 6 6 6 6 6 1 1 1 1 1 1 1 1 1 1 1 1 1 1 1 1 1 1 1
symmnumber: 1
zpe: 814720.7 jmol-1
zpe.correction: 0.310311 hartree
zpe.thermalcorrener: 0.332367 hartree
zpe.thermalcorrenthalpy: 0.333311 hartree
zpe.thermalcorrgfe: 0.255430 hartree
zpe.sumelectzpe: -1297.088862 hartree
zpe.sumelectthermal: -1297.066805 hartree
zpe.sumelectthermalent: -1297.065861 hartree
zpe.sumelectthermalfe: -1297.143742 hartree
dipole: 2.1829 -3.0080 3.0779
dipole: 4.8256
quadrupole: -99.0651 -128.8069 -133.7919
quadrupole: -9.3881 2.7837 11.3782
quadrupole: 21.4895 -8.2523 -13.2373 -9.3881 2.7837 11.3782
hfenergy: -1297.3991724 hartree
pointgroup: C01 [X(C14H19N1O4S1)]
dipole: -0.7322236 -1.0857835 -1.3745377 debye
polarizability: 241.5764841|-21.4440792|187.3518456|10.421418|-10.8942822|143.0845288 unknown
InChI: InChI=1S/C14H19NO4S/c1-10(17)15-12(14(18)19)9-20-13(7-8-16)11-5-3-2-4-6-11/h2-6,12-13,15-16,18H,7-9H2,1H3
charge 0 multiplicity 1
39 atoms
S  -0.017184 0.197643 -1.730854
O  1.62417 4.029151 1.650241
O  -4.898514 0.105255 -1.07231
O  -4.2394 2.02291 0.06987
O  -1.150438 -1.580156 1.267888
N  -2.655865 -1.212439 -0.466522
C  0.839135 0.648592 -0.051725
C  1.010253 2.174138 0.092483
C  2.131381 -0.154151 -0.015913
C  -1.738302 0.918398 -1.499602
C  -2.581474 0.241644 -0.362662
C  1.552981 2.567298 1.484576
C  2.215212 -1.30682 0.808384
C  3.2580 0.213579 -0.797927
C  -3.961472 0.895332 -0.383398
C  3.407882 -2.062344 0.86421
C  4.447916 -0.54561 -0.746468
C  4.52868 -1.684346 0.088841
C  -1.903621 -2.039886 0.351172
C  -2.026252 -3.530699 0.071928
H  0.157045 0.250957 0.72042
H  1.689113 2.555001 -0.69605
H  0.039102 2.685345 -0.046816
H  -2.225436 0.767215 -2.479797
H  -1.673859 2.00253 -1.305947
H  -2.114259 0.472052 0.611187
H  0.861359 2.237073 2.278117
H  2.541839 2.097905 1.664366
H  1.337792 -1.606547 1.393804
H  3.203354 1.088247 -1.456845
H  -3.280268 -1.61072 -1.169228
H  3.461691 -2.945831 1.510582
H  5.309517 -0.252268 -1.357209
H  5.453177 -2.271355 0.132047
H  2.275014 4.391949 0.997372
H  -1.08159 -3.88727 -0.375923
H  -2.164772 -4.067021 1.02487
H  -2.855994 -3.782138 -0.610793
H  -5.773013 0.578585 -1.10727
