program: Gaussian 09
title: 000010513
version: EM64L-G09RevD.01
frameworkgroup: C1[X(C21H24N2O3)]
method: RPBEPBE
basis: SDD
operation: Freq
keyword: #p
keyword: freq=noraman
keyword: PBEPBE/SDD
title: #p freq=noraman PBEPBE/SDD
converged: YES YES NO NO
title: Mulliken charges:
elementType: O O O N N C C C C C C C C C C C C C C C C C C C C C H H H H H H H H H H H H H H H H H H H H H H H H
charge: -0.221510 -0.449846 -0.253912 -0.036097 -0.233677 0.261489 -0.232355 -0.320756 -0.013530 -0.232544 -0.547365 -0.524294 -0.409057 0.258995 0.503777 -0.665750 0.196303 -0.228351 -0.437255 -0.451463 0.165828 -0.306120 -0.355177 -0.255062 -0.248119 -0.797776 0.229783 0.305461 0.235080 0.262231 0.238189 0.222676 0.223507 0.245544 0.206758 0.225982 0.229615 0.240181 0.267217 0.241072 0.231599 0.244568 0.215240 0.216596 0.352987 0.228582 0.227428 0.249006 0.231828 0.262498
chargesum: 0.00000
title: Mulliken charges with hydrogens summed into heavy atoms:
elementType: O O O N N C C C C C C C C C C C C C C C C C C C C C
charge: -0.221510 -0.096859 -0.253912 -0.036097 -0.233677 0.261489 -0.002573 -0.015295 0.221550 0.029688 -0.086500 -0.055243 0.023684 0.258995 0.503777 -0.195955 0.196303 0.038866 -0.196183 -0.219863 0.165828 -0.061553 0.076659 -0.026480 -0.020692 -0.054444
polarizability: 2.79354429e+02 8.82967891e+00 2.45642840e+02 2.97463894e+01 1.12902109e+01 1.84738020e+02
1716.lowfreq: -9.8686 -0.0003 0.0005 0.0005 2.4026 7.2902 41.6351 62.7949 71.8283
frequency: 41.4926 62.7748 71.8107 84.6299 93.5015 115.2363 131.1514 164.2576 179.3153 189.3992 229.1132 238.9453 247.7701 262.3701 278.7005 297.9977 319.1852 325.6731 350.4821 365.2365 378.7759 392.9715 408.5609 418.2389 421.0653 449.6507 468.8132 495.8958 513.6077 527.9768 537.3893 561.3671 569.7746 578.3085 593.4634 619.4877 633.5584 643.5556 654.5122 675.7195 710.8090 741.9235 749.0062 756.8779 762.5690 773.4001 792.7165 831.3379 853.3749 859.7678 866.3398 891.1597 913.3787 928.7866 937.0096 941.3543 945.8919 957.5483 969.0183 977.8463 978.6714 1001.2848 1004.7769 1021.3605 1022.2426 1032.7313 1038.3242 1047.4714 1058.4256 1066.0160 1074.5290 1083.2709 1091.0076 1093.1044 1107.6221 1127.0999 1138.6652 1170.0953 1175.5507 1181.2758 1184.5347 1197.6108 1220.7166 1227.9738 1235.2191 1248.1426 1251.0198 1259.0805 1271.9276 1279.9365 1287.4436 1292.9747 1307.0061 1309.6533 1312.8663 1318.7022 1333.1445 1335.1581 1345.1527 1347.2761 1357.7391 1360.5308 1365.9278 1370.9877 1381.4917 1392.5616 1399.9083 1448.4352 1455.7323 1464.3172 1465.5463 1468.3868 1471.0878 1479.0421 1493.9400 1496.7194 1580.3254 1601.7071 1611.1562 1678.5366 2923.4158 2951.3610 2970.9950 2971.5603 2985.5453 2991.4438 2993.0404 3003.3416 3007.8931 3021.1941 3050.5942 3052.6120 3056.5759 3063.8245 3075.4406 3081.7932 3082.8828 3108.6627 3127.5667 3128.9830 3139.3603 3160.9901 3183.1572 3554.0940
redmass: 5.7188 4.7007 3.6095 5.7317 4.5732 3.5586 5.1098 4.4057 5.1427 3.9164 1.3139 2.5422 3.9561 3.0493 3.2746 3.5545 4.0024 3.6802 3.9645 3.9658 3.2435 1.3510 3.8476 2.7669 2.3523 4.0441 3.1785 4.6076 3.2622 3.8610 4.0597 3.7890 4.5391 3.8219 3.8177 5.1039 3.5703 4.9323 3.9793 4.9892 4.4165 3.7862 2.2514 2.3837 2.1194 2.9938 3.0166 1.8884 1.9042 3.4538 1.3841 3.5762 2.4399 4.4502 1.4367 4.5047 2.5313 2.6284 2.1552 1.3256 2.3602 2.2635 3.5412 3.7650 2.2296 1.6684 1.9865 2.2292 2.7552 2.7059 2.0828 2.6098 2.5056 2.8784 2.0185 2.0881 2.3713 1.5090 1.1167 1.3475 2.1296 1.6692 1.4650 1.3680 1.3434 1.3660 2.3124 1.6524 1.5591 1.3626 1.3768 1.6174 1.3138 1.5438 1.5999 1.3247 1.5086 1.2527 1.3129 1.4454 1.5209 1.9768 1.5165 1.5617 1.2394 1.4465 4.3903 2.3811 1.1791 1.0841 1.0929 1.1381 1.1441 2.0734 1.0902 1.0798 7.1953 7.3157 7.0485 8.0838 1.0697 1.0837 1.0663 1.0667 1.0802 1.0810 1.0379 1.0674 1.0663 1.0868 1.0975 1.0862 1.1012 1.0864 1.1031 1.0947 1.0974 1.0935 1.0989 1.0863 1.0906 1.0970 1.0951 1.0656
irintensity: 0.1124 0.7569 2.7204 2.0242 0.7214 2.5901 2.3952 1.6702 2.1266 1.6975 1.0801 0.6132 2.1139 2.6303 5.4514 5.4662 6.9977 0.9741 12.6480 5.0247 25.4653 92.1551 2.5128 3.2122 5.6071 3.0633 18.9997 12.9740 15.4775 9.7487 5.6953 11.8885 5.4571 6.9300 9.6503 0.1912 2.2145 4.1832 18.6734 2.5669 12.5617 2.2884 28.6773 16.8245 37.9146 2.5503 8.4885 23.4088 37.2284 7.1878 3.2991 33.4219 13.3095 79.9177 0.8806 1.9031 10.7670 17.2139 4.2433 0.0562 6.3560 10.0200 5.6931 48.1678 8.7519 3.2663 5.7608 19.3146 9.4543 37.8984 13.1372 3.2498 14.1614 9.9772 7.2577 15.4196 33.7198 3.0275 1.3707 13.8337 10.8189 4.2358 11.5991 2.5624 6.1347 14.7137 60.7406 40.7193 4.9724 2.5763 21.8640 15.8806 10.2490 72.3806 14.9991 6.3081 3.7452 1.5945 4.8883 18.5164 27.5390 71.1839 47.0428 0.5560 49.2359 1.0463 5.2154 7.8755 101.5216 10.6968 14.9010 4.4614 35.5866 70.0310 0.9478 14.4261 241.2471 31.5606 0.6153 12.0456 43.9406 51.2068 32.1416 66.4475 6.6955 7.1185 7.1775 13.9107 55.1912 73.1922 32.6044 22.3589 19.1021 5.6743 16.5949 20.3549 10.8313 33.9706 10.5526 1.3418 14.6618 28.1804 13.2495 6.3896
temp: 298.150 k
press: 1.00000 atm
elementType: 8 8 8 7 7 6 6 6 6 6 6 6 6 6 6 6 6 6 6 6 6 6 6 6 6 6 1 1 1 1 1 1 1 1 1 1 1 1 1 1 1 1 1 1 1 1 1 1 1 1
symmnumber: 1
zpe: 1087772.3 jmol-1
zpe.correction: 0.414311 hartree
zpe.thermalcorrener: 0.435140 hartree
zpe.thermalcorrenthalpy: 0.436084 hartree
zpe.thermalcorrgfe: 0.366870 hartree
zpe.sumelectzpe: -1147.877030 hartree
zpe.sumelectthermal: -1147.856200 hartree
zpe.sumelectthermalent: -1147.855256 hartree
zpe.sumelectthermalfe: -1147.924470 hartree
dipole: -1.8752 -1.3203 -1.6013
dipole: 2.7971
quadrupole: -136.2696 -152.9948 -156.4373
quadrupole: -4.3880 -0.1713 -6.6729
quadrupole: 12.2976 -4.4276 -7.8701 -4.3880 -0.1713 -6.6729
hfenergy: -1148.2913401 hartree
pointgroup: C01 [X(C21H24N2O3)]
dipole: 0.753414 -0.5106042 0.6186326 debye
polarizability: 280.0110431|-8.4790093|245.5437198|29.544211|-9.4371791|184.1805262 unknown
InChI: InChI=1S/C21H24N2O3/c1-12(24)23-16-5-3-2-4-15(16)21-7-8-22-11-13-6-9-26-20(25)18(19(21)23)14(13)10-17(21)22/h2-6,14,17-20,25H,7-11H2,1H3
charge 0 multiplicity 1
50 atoms
O  -2.674264 2.18735 -0.009922
O  -1.938672 2.244965 2.284853
O  0.11926 2.801914 -1.746132
N  -1.276324 -2.654417 -0.822089
N  1.181342 1.213555 -0.429214
C  0.583833 -1.118289 -0.448581
C  -0.264393 -2.248273 0.219278
C  -0.045415 0.329552 -0.383496
C  -0.868211 0.598845 0.909876
C  -1.82096 -0.591062 1.251937
C  -0.935148 -1.823893 1.536948
C  0.609579 -1.624084 -1.925474
C  -0.844006 -2.10731 -2.147512
C  1.963957 -0.896118 0.152108
C  -2.828756 -0.938959 0.140496
C  -2.686686 -2.340354 -0.445677
C  2.286711 0.488483 0.1254
C  -1.544837 1.989354 0.891509
C  2.887029 -1.82804 0.654828
C  -3.756567 -0.050047 -0.30341
C  1.188609 2.382497 -1.206926
C  3.514635 0.957195 0.637806
C  -3.874327 1.348569 0.259985
C  4.133913 -1.371479 1.1543
C  4.436117 0.0089 1.147346
C  2.507217 3.124176 -1.38554
H  0.41546 -3.103565 0.411251
H  -0.664709 0.565263 -1.266003
H  -0.148236 0.663154 1.751477
H  -2.373326 -0.297443 2.167263
H  -0.158661 -1.58095 2.2860
H  -1.52565 -2.663581 1.947249
H  1.323505 -2.463926 -2.015106
H  0.910576 -0.837914 -2.639236
H  -1.488517 -1.254875 -2.459192
H  -0.904833 -2.879734 -2.936465
H  -3.031777 -3.097854 0.286043
H  -3.320579 -2.45888 -1.34246
H  -0.835794 2.756471 0.533594
H  2.651086 -2.898178 0.665468
H  -4.44081 -0.33536 -1.114005
H  3.760536 2.02076 0.67156
H  -4.696453 1.904432 -0.217946
H  -4.047596 1.324892 1.356019
H  -2.283203 3.173346 2.336818
H  4.858979 -2.087809 1.554955
H  5.392319 0.359044 1.551807
H  3.3474 2.446208 -1.614147
H  2.766348 3.697749 -0.476569
H  2.371998 3.837518 -2.212173
