program: Gaussian 09
title: 000130757
version: EM64L-G09RevD.01
frameworkgroup: C1[X(C19H16O5)]
method: RPBEPBE
basis: SDD
operation: Freq
keyword: #pfreq=noraman
keyword: PBEPBE/SDD
title: #p freq=noraman PBEPBE/SDD
converged: YES YES NO NO
title: Mulliken charges:
elementType: O O O O O C C C C C C C C C C C C C C C C C C C H H H H H H H H H H H H H H H H
charge: -0.446679 -0.202295 -0.190012 -0.159598 -0.375214 0.300236 -0.477183 -0.508253 -0.645317 0.246436 -0.525514 0.191688 0.186922 0.481178 -0.538720 -0.211647 -0.123216 0.358668 0.100184 -0.817905 0.191055 -0.420361 -0.415060 -0.203560 0.309895 0.241603 0.227054 0.232494 0.239393 0.252881 0.272444 0.264009 0.333104 0.237706 0.242809 0.233980 0.293758 0.224103 0.239718 0.359213
chargesum: 0.00000
title: Mulliken charges with hydrogens summed into heavy atoms:
elementType: O O O O O C C C C C C C C C C C C C C C C C C C
charge: -0.113575 -0.202295 -0.190012 -0.159598 -0.016001 0.300236 -0.167288 -0.039595 -0.173430 0.246436 -0.000189 0.191688 0.186922 0.481178 -0.274711 -0.211647 -0.123216 0.358668 0.100184 -0.103410 0.191055 -0.126603 -0.190957 0.036158
polarizability: 3.19599715e+02 1.15295674e+01 2.22559323e+02 1.66189342e+01 -1.20172082e+01 1.37728914e+02
1716.lowfreq: -6.3927 -0.0009 -0.0006 -0.0006 4.9390 10.7833 30.0305 47.1829 55.9740
frequency: 29.9594 47.1822 55.9711 67.8200 90.2306 119.1622 138.8387 148.8525 171.6203 178.6295 187.8515 200.5930 231.1052 256.8234 273.0769 295.4682 296.6163 316.2840 342.2904 361.1777 369.8547 380.2859 406.8392 413.2559 419.1929 435.4786 452.9830 470.3047 474.5580 497.8395 517.4714 532.3502 542.6174 570.1178 582.8590 597.4507 624.2391 676.2189 690.8958 725.7091 752.0900 763.7918 780.0988 796.7404 831.6704 849.0873 857.7743 877.4636 887.1804 907.4101 914.0486 920.8855 930.9769 984.8561 988.9266 1000.9175 1014.3032 1038.5660 1051.4312 1064.0488 1069.7177 1097.6205 1135.8781 1147.0511 1150.5695 1152.9777 1168.9047 1177.0916 1196.8688 1206.3742 1215.7504 1237.0626 1241.5293 1259.7176 1278.5946 1281.7233 1301.1347 1321.5941 1334.6906 1351.9261 1371.0923 1376.6661 1394.3958 1401.2616 1430.1722 1436.5313 1443.5790 1458.1407 1462.1862 1463.5189 1468.1845 1525.2631 1540.2680 1579.0966 1594.4989 1601.7167 1643.3295 1650.1156 2942.4615 2943.6246 2967.5010 2996.1571 3006.8170 3021.8991 3039.1517 3048.5786 3068.0309 3095.2744 3114.4259 3140.3638 3153.6984 3175.6711 3536.2539 3547.1935
redmass: 6.2097 5.3072 6.2135 6.8544 6.3219 4.7645 2.0646 2.4047 4.9943 2.4477 2.9675 3.0114 4.5599 3.7450 2.5650 2.0134 1.9585 4.0048 5.5535 5.1339 6.0094 6.3061 3.7590 2.1321 1.8372 3.0025 7.1013 4.2215 3.9700 3.8852 5.1976 5.8800 5.1661 5.5106 4.1643 5.7158 4.1336 3.5713 4.3164 5.3531 3.0937 3.7129 2.3780 2.3801 2.6328 2.9927 4.6757 3.2174 3.0494 1.6433 1.9000 2.6965 2.6859 2.7802 1.3679 1.6881 1.9150 1.9205 4.4817 2.3369 2.3063 1.8614 1.8142 2.0804 2.3478 2.0367 1.2010 1.1942 1.4248 1.4624 1.4185 2.2966 1.9338 2.5628 3.7750 1.7664 1.9791 1.7405 1.9615 2.4531 2.2976 2.4087 1.2438 7.8012 1.1028 1.0934 2.7933 1.0524 1.0764 1.0897 3.1555 10.4230 10.0595 10.4023 7.0145 7.1024 8.6449 6.4949 1.0686 1.0779 1.0383 1.0631 1.0618 1.0921 1.0957 1.0945 1.1025 1.0986 1.0894 1.0924 1.0915 1.0971 1.0656 1.0659
irintensity: 7.4765 1.1462 2.0261 2.0515 1.9922 0.2146 0.4720 1.2403 0.2311 5.2839 1.0275 1.3654 1.0818 1.6097 9.7900 60.8329 29.4811 9.9427 48.8187 6.8925 12.9283 19.7008 11.5781 67.5887 46.4054 9.1065 7.1126 14.3422 3.0345 1.3073 3.2293 3.5523 2.9218 1.9780 4.4118 10.2707 4.5618 13.1917 9.9066 15.6772 5.3939 15.2789 43.6713 26.9758 8.9969 5.9067 18.5085 6.0929 14.2892 5.6655 14.2362 23.8788 34.0682 54.5202 2.4082 13.1207 0.6082 3.7654 16.9652 30.7078 4.1789 29.0996 48.5654 76.3299 10.6911 14.5605 19.3168 6.1996 6.3464 6.4052 38.6536 109.9268 157.8434 49.3610 145.8870 109.8525 115.0852 38.1778 7.4375 30.5835 38.4966 17.7778 32.5246 1.3620 22.6369 20.4058 15.1392 15.2812 20.4847 7.8371 10.2385 41.5462 255.7086 124.4582 40.4403 13.3430 48.7359 127.2849 11.3949 24.9734 23.0322 7.5631 19.4056 19.2945 14.5825 9.9341 17.4603 20.4917 13.9654 10.9550 13.0947 9.6885 34.3118 5.5193
temp: 298.150 k
press: 1.00000 atm
elementType: 8 8 8 8 8 6 6 6 6 6 6 6 6 6 6 6 6 6 6 6 6 6 6 6 1 1 1 1 1 1 1 1 1 1 1 1 1 1 1 1
symmnumber: 1
zpe: 797707.3 jmol-1
zpe.correction: 0.303831 hartree
zpe.thermalcorrener: 0.324465 hartree
zpe.thermalcorrenthalpy: 0.325409 hartree
zpe.thermalcorrgfe: 0.255287 hartree
zpe.sumelectzpe: -1108.030494 hartree
zpe.sumelectthermal: -1108.009860 hartree
zpe.sumelectthermalent: -1108.008916 hartree
zpe.sumelectthermalfe: -1108.079038 hartree
dipole: 1.4443 -0.3249 0.9621
dipole: 1.7655
quadrupole: -78.1369 -154.1496 -141.0027
quadrupole: 8.3132 3.0237 -4.1819
quadrupole: 46.2929 -29.7199 -16.5730 8.3132 3.0237 -4.1819
hfenergy: -1108.3343251 hartree
pointgroup: C01 [X(C19H16O5)]
dipole: -0.5648782 -0.1194199 -0.386196 debye
polarizability: 319.3178453|-11.9774897|221.9530954|17.8963443|13.8515796|138.6170101 unknown
InChI: InChI=1S/C19H16O5/c1-9-7-13(21)16-15-11(5-6-19(16,24)8-9)17(22)14-10(18(15)23)3-2-4-12(14)20/h2-4,7,16,20,24H,5-6,8H2,1H3
charge 0 multiplicity 1
40 atoms
O  -2.15105 1.402623 -2.07842
O  -1.344201 -1.801515 1.557784
O  0.382167 -2.247816 -1.210638
O  2.026613 2.652479 0.539547
O  4.547406 1.733243 0.805303
C  -2.530111 0.809987 -0.774156
C  -1.663112 -0.439574 -0.473349
C  -2.212214 1.91586 0.253626
C  -4.028704 0.430353 -0.815483
C  -0.195148 -0.095274 -0.334164
C  -0.721751 2.316553 0.220659
C  0.230816 1.155243 0.04313
C  -2.153944 -1.191168 0.801431
C  -4.494054 -0.429618 0.347773
C  -3.603777 -1.177051 1.072404
C  0.773687 -1.168392 -0.655656
C  1.690584 1.46195 0.240788
C  2.221516 -0.935081 -0.351772
C  2.672676 0.347749 0.092203
C  -5.974589 -0.427159 0.643051
C  4.067054 0.501974 0.366586
C  3.113413 -2.015261 -0.521928
C  4.9582 -0.591928 0.198633
C  4.485026 -1.840976 -0.243392
H  -1.768006 -1.181511 -1.296644
H  -2.493232 1.556274 1.260499
H  -2.83408 2.801683 0.030412
H  -4.22814 -0.126592 -1.75788
H  -4.6361 1.353568 -0.8805
H  -0.444746 2.886181 1.126162
H  -0.543679 3.009603 -0.624591
H  -3.933113 -1.791883 1.918173
H  -2.174928 0.695587 -2.773276
H  -6.31308 0.585686 0.938111
H  -6.239718 -1.131042 1.448931
H  -6.554894 -0.697802 -0.261143
H  2.711329 -2.971983 -0.866032
H  6.025658 -0.455578 0.417515
H  5.184997 -2.673628 -0.365981
H  5.524832 1.682635 0.967685
