program: Gaussian 09
title: 000130756
version: EM64L-G09RevD.01
frameworkgroup: C1[X(C17H25ClO3)]
method: RPBEPBE
basis: SDD
operation: Freq
keyword: #p
keyword: freq=noraman
keyword: PBEPBE/SDD
title: #p freq=noraman PBEPBE/SDD
converged: YES YES NO NO
title: Mulliken charges:
elementType: Cl O O O C C C C C C C C C C C C C C C C C H H H H H H H H H H H H H H H H H H H H H H H H H
charge: -0.071035 -0.297585 -0.446805 -0.452909 -0.058191 -0.071690 -0.468655 -0.380468 -0.556596 -0.390893 -0.358585 -0.358132 0.124774 -0.350958 -0.721278 -0.112255 -0.100491 -0.207632 -0.029866 0.099398 -0.634278 0.237712 0.238852 0.220949 0.212796 0.202576 0.200872 0.254581 0.252681 0.218451 0.193255 0.185535 0.183972 0.183615 0.209431 0.177263 0.192426 0.203665 0.206512 0.254149 0.259894 0.250058 0.299985 0.294027 0.355215 0.355656
chargesum: 0.00000
title: Mulliken charges with hydrogens summed into heavy atoms:
elementType: Cl O O O C C C C C C C C C C C C C C C C C
charge: -0.071035 -0.297585 -0.091150 -0.097694 0.179521 0.167162 -0.034910 0.022980 -0.049333 0.020813 0.010923 0.034914 0.124774 0.018731 -0.056952 -0.112255 -0.100491 0.052262 0.220192 0.099398 -0.040266
polarizability: 2.95635277e+02 3.51223056e+01 1.87310725e+02 1.07136916e+01 3.84840593e+00 1.59720370e+02
1716.lowfreq: -9.1901 0.0009 0.0018 0.0018 3.8679 6.1002 13.6504 17.8249 23.8654
frequency: 12.9396 17.7159 23.6596 32.0746 46.0413 49.0833 65.4391 70.7622 75.4215 88.8209 94.9891 112.9728 117.7285 133.3603 149.6038 156.2374 166.0710 193.5013 222.3822 238.6429 246.8686 257.2334 273.3677 285.0675 291.9076 312.0018 346.5137 378.1229 386.7605 399.9223 403.9662 417.2615 447.8145 471.5458 495.1642 499.1085 523.4633 542.9346 569.9955 648.2938 710.7310 725.7540 742.6422 747.3732 771.1081 800.3298 831.2687 854.3835 869.6145 886.4810 897.1425 901.8068 933.9669 942.2210 976.2864 999.8517 1004.5527 1009.6554 1024.8827 1040.5099 1056.5102 1064.7159 1071.4603 1079.5427 1086.9016 1092.2408 1124.1663 1133.3002 1151.4380 1178.0298 1194.6445 1198.9968 1210.4835 1215.2678 1232.9973 1244.5109 1250.7928 1251.8939 1263.9769 1278.9531 1280.9477 1287.3969 1291.1732 1299.3012 1301.9743 1319.0562 1326.8487 1336.2703 1337.7294 1355.1433 1359.3074 1360.1464 1373.9854 1395.5973 1436.8422 1437.1677 1452.0999 1461.0071 1461.5473 1466.4710 1468.8263 1475.1997 1480.3205 1485.2527 1497.4197 2173.6031 2295.8776 2946.8708 2949.4080 2956.9513 2962.1398 2962.9660 2968.9232 2969.7500 2983.5532 2984.9914 2986.8992 2993.5385 2999.7015 3008.8336 3027.3515 3034.2738 3040.2728 3049.8825 3062.0138 3073.4093 3073.9623 3087.4640 3096.2853 3167.4974 3527.2243 3572.2460
redmass: 6.4660 4.7754 5.6637 6.3658 4.2740 5.0705 1.9056 3.2953 3.8573 6.1683 3.9553 3.3045 1.9069 2.7480 2.9160 4.4993 3.6556 3.8048 8.1371 3.5146 1.6236 1.8360 1.7403 1.6959 4.1189 3.6212 3.9384 4.6738 1.4178 2.1800 4.1640 3.0897 3.5548 4.2146 8.2332 5.9997 3.8600 5.5220 5.5197 5.6702 2.0634 1.0960 1.5568 3.7080 1.7560 1.7089 2.7759 1.8404 2.3039 2.7409 1.9177 1.5609 1.9710 4.8283 1.4324 2.2540 2.9213 2.1586 1.6846 1.7131 2.3556 2.4631 1.9555 1.6319 1.7005 2.5328 2.2391 1.8081 1.2493 1.2451 1.6044 1.1935 1.3525 1.2313 1.3674 1.3262 1.2339 1.3083 1.3956 1.2339 1.2141 1.0865 1.2268 1.1973 1.7203 1.2130 1.3945 1.5478 1.3961 1.6266 1.5548 1.7217 1.5227 1.2106 1.1189 2.0914 1.2163 1.0971 1.0915 1.0806 1.0930 1.0884 1.0510 1.0923 1.0596 11.8338 11.9020 1.0591 1.0594 1.0599 1.0635 1.0784 1.0364 1.0593 1.0587 1.0932 1.0662 1.0981 1.0852 1.0997 1.1034 1.0999 1.1029 1.1023 1.0992 1.0560 1.1008 1.0934 1.0886 1.1115 1.0655 1.0666
irintensity: 0.3250 0.2460 0.1059 0.0237 0.6112 0.9985 0.1219 0.2499 1.8924 4.9331 2.3524 0.5490 0.3634 1.1414 2.8456 1.7441 1.5895 0.3879 6.3307 2.2261 0.7214 0.1886 82.4257 56.9444 3.6149 14.6172 9.7615 2.2167 86.6612 81.8124 8.5566 4.0282 8.3185 8.9716 2.3853 1.5787 6.0615 10.9669 34.1498 18.2214 2.1965 15.3333 4.1299 15.7124 18.4154 28.6881 2.5944 13.7582 16.8871 18.0246 13.3628 11.8357 8.3863 148.4954 3.5301 7.6575 0.1319 32.7730 3.2969 5.9886 0.2355 30.1963 6.6745 1.4653 2.7762 8.7545 1.2607 4.2703 21.8884 6.0009 7.7088 60.1329 6.1212 17.8359 0.6446 0.7025 2.8879 0.4333 5.4291 11.4782 12.1237 0.1449 0.3142 0.8669 9.3383 5.9774 1.2686 34.7355 3.5597 0.9719 0.6120 14.8035 45.0460 12.5499 14.8464 6.3178 15.2037 0.8890 2.5833 4.1110 12.4225 0.6943 6.9050 15.7398 11.5643 1.6419 44.3305 0.8283 16.7458 3.2498 42.3254 25.6972 35.2898 106.9153 14.0300 4.8864 30.6129 4.8833 31.6004 10.3883 11.0932 5.7392 115.2573 85.6783 63.4875 8.3899 42.6529 1.2483 48.3900 4.1023 15.7690 18.5163
temp: 298.150 k
press: 1.00000 atm
elementType: 17 8 8 8 6 6 6 6 6 6 6 6 6 6 6 6 6 6 6 6 6 1 1 1 1 1 1 1 1 1 1 1 1 1 1 1 1 1 1 1 1 1 1 1 1 1
symmnumber: 1
zpe: 998995.9 jmol-1
zpe.correction: 0.380497 hartree
zpe.thermalcorrener: 0.406183 hartree
zpe.thermalcorrenthalpy: 0.407128 hartree
zpe.thermalcorrgfe: 0.320340 hartree
zpe.sumelectzpe: -1346.733216 hartree
zpe.sumelectthermal: -1346.707530 hartree
zpe.sumelectthermalent: -1346.706586 hartree
zpe.sumelectthermalfe: -1346.793373 hartree
dipole: -0.5973 0.5916 1.8773
dipole: 2.0570
quadrupole: -156.6739 -134.3606 -128.9129
quadrupole: -3.0347 -2.1880 -3.1791
quadrupole: -16.6914 5.6219 11.0695 -3.0347 -2.1880 -3.1791
hfenergy: -1347.1137139 hartree
pointgroup: C01 [X(C17H25Cl1O3)]
dipole: -0.1815835 -0.1554006 -0.7731792 debye
polarizability: 298.7688184|-30.9223998|184.3049885|-5.9113152|4.4306596|159.5925659 unknown
InChI: InChI=1S/C17H25ClO3/c1-2-3-4-5-8-11-16-17(21-16)12-9-6-7-10-14(19)15(20)13-18/h14-17,19-20H,2-5,8,11-13H2,1H3
charge 0 multiplicity 1
46 atoms
Cl 5.632847 1.53644 2.106315
O  -5.317568 1.606863 0.72859
O  3.831594 0.934134 -2.112527
O  3.548495 -0.675942 1.158177
C  -4.306992 0.46095 0.693222
C  -4.049561 1.715415 -0.077821
C  -4.73339 -0.822698 0.002773
C  -3.552573 -1.518653 -0.726284
C  -3.028125 2.747757 0.414606
C  -2.366392 -1.904752 0.18833
C  -1.240349 -2.634768 -0.578624
C  -0.016372 -2.978614 0.299421
C  -1.659637 2.326063 0.083254
C  1.096285 -3.723547 -0.473925
C  2.328917 -4.040921 0.4006
C  -0.534764 1.877721 -0.191927
C  0.702008 1.355712 -0.471378
C  3.110148 0.237687 -1.021085
C  4.115029 0.231762 0.161331
C  1.815824 0.862381 -0.712015
C  4.34243 1.638025 0.716025
H  -3.777691 0.356805 1.650998
H  -4.213583 1.69401 -1.164215
H  -5.530356 -0.576637 -0.724836
H  -5.176578 -1.511922 0.747654
H  -3.18143 -0.853094 -1.532361
H  -3.936935 -2.430984 -1.225229
H  -3.138651 2.850152 1.512162
H  -3.250914 3.740752 -0.021663
H  -1.942399 -0.994241 0.657717
H  -2.729832 -2.549595 1.015835
H  -0.909996 -1.997256 -1.426016
H  -1.645917 -3.565963 -1.028212
H  -0.341216 -3.602061 1.158898
H  0.404586 -2.046499 0.729439
H  1.408415 -3.104714 -1.34225
H  0.682221 -4.661849 -0.897923
H  2.0455 -4.669701 1.266253
H  3.10124 -4.587927 -0.172306
H  2.782188 -3.109425 0.786922
H  2.934705 -0.825577 -1.290488
H  5.070845 -0.163869 -0.238664
H  4.759647 2.313203 -0.042935
H  3.440439 2.051996 1.188778
H  4.111452 -0.624687 1.974853
H  3.213107 1.053967 -2.877172
