program: Gaussian 09
title: 000130656
version: EM64L-G09RevD.01
frameworkgroup: C1[X(C15H20N2O2)]
method: RPBEPBE
basis: SDD
operation: Freq
keyword: #p
keyword: freq=noraman
keyword: PBEPBE/SDD
title: #p freq=noraman PBEPBE/SDD
converged: YES YES NO NO
title: Mulliken charges:
elementType: O O N N C C C C C C C C C C C C C C C H H H H H H H H H H H H H H H H H H H H
charge: -0.204066 -0.223597 -0.355956 -0.697766 0.100307 -0.065905 -0.569410 -0.483747 -0.405664 0.497595 0.101790 0.114157 -0.712191 -0.721875 -0.367000 -0.417218 -0.459143 -0.466577 0.508611 0.230358 0.262136 0.247908 0.224165 0.220780 0.247986 0.196673 0.345201 0.239519 0.249864 0.206713 0.215919 0.218751 0.221912 0.226805 0.232298 0.215792 0.215280 0.304351 0.305244
chargesum: 0.00000
title: Mulliken charges with hydrogens summed into heavy atoms:
elementType: O O N N C C C C C C C C C C C C C C C
charge: -0.204066 -0.223597 -0.010755 -0.088171 0.100307 0.164453 -0.059366 -0.038802 0.038995 0.497595 0.101790 0.114157 -0.016095 -0.065293 -0.140195 -0.184921 -0.243350 -0.251297 0.508611
polarizability: 2.42677227e+02 -2.70990188e+00 1.44897069e+02 -4.07594155e-01 3.79789013e+00 1.55393707e+02
1716.lowfreq: -5.7176 0.0007 0.0007 0.0009 3.5504 9.5764 35.9619 46.8488 52.0330
frequency: 35.9041 46.7006 52.0208 80.1977 99.6870 125.6716 140.1586 151.8408 167.8486 181.6343 187.8860 209.6578 229.4979 257.1156 285.4845 312.0590 328.2100 346.0691 359.3808 366.4296 370.5585 385.6838 409.8749 421.9467 444.5976 469.9520 529.0080 540.1967 555.6181 592.2965 637.5337 640.1249 655.1207 699.6700 731.1468 768.8767 780.8005 812.9932 815.5912 818.8231 826.0609 861.3212 896.3845 909.7863 924.8583 930.9467 945.1943 952.6432 994.3771 1002.1055 1019.0235 1028.4120 1046.6302 1082.8615 1091.2826 1101.1180 1126.3035 1139.0364 1146.3779 1188.5984 1199.1093 1213.4259 1240.0077 1258.9918 1295.7618 1297.7056 1300.7445 1312.7069 1318.3054 1321.4526 1333.0705 1337.2131 1346.8860 1375.5484 1377.9828 1391.9676 1400.7527 1434.6379 1447.8559 1472.3688 1473.2348 1479.9595 1482.5668 1489.1864 1491.1261 1520.7330 1579.1876 1617.3631 1633.7565 1636.0472 1646.2781 2959.1536 2977.4802 2979.1363 2989.2907 2991.9431 2996.8671 3039.6743 3041.8988 3068.5705 3073.3812 3077.3336 3082.3726 3098.1941 3112.9646 3116.3593 3136.4602 3148.0212 3474.1615 3567.6222 3707.5841
redmass: 7.1436 3.5802 3.6465 2.4553 2.5723 2.8963 5.6682 2.4611 3.2672 2.9064 1.7019 3.0197 1.3619 4.3843 2.3756 3.0489 3.3495 1.3035 6.1393 3.7466 1.0866 3.0461 2.7484 3.7929 3.4949 3.2355 2.6478 3.5547 3.7659 3.7464 3.5469 6.7228 4.8801 3.6714 3.4456 1.4459 1.2271 1.2958 1.4738 1.6775 4.3487 2.7376 2.1569 2.5187 2.5407 1.5510 1.6198 1.3745 1.8996 2.6988 1.4472 3.4238 2.3290 2.4685 2.3853 1.8379 2.2210 1.8055 1.6235 1.5271 1.1966 2.7704 2.0594 1.3529 1.2354 1.5206 1.4204 3.2071 2.1777 1.5830 1.3771 1.4883 1.4807 2.5495 2.8007 1.2041 1.2012 3.5440 1.0840 1.0420 1.0598 1.0564 1.0518 1.0572 1.0884 2.8433 6.4953 8.3190 2.0746 5.3326 1.9615 1.0800 1.0361 1.0646 1.0575 1.0476 1.0577 1.0978 1.0998 1.0939 1.0998 1.0986 1.0989 1.0999 1.0868 1.0876 1.0959 1.0946 1.0756 1.0449 1.1040
irintensity: 0.2506 0.0928 0.5328 1.2512 1.1907 1.8485 5.4025 1.9023 1.8423 1.6932 0.2854 1.8035 0.6653 3.5830 0.7359 1.7334 2.4831 271.1628 5.1814 34.1256 13.1968 4.3715 0.1120 4.7617 6.7158 2.5736 23.0536 20.2919 1.6975 5.2984 0.2845 0.3192 5.4533 2.6874 1.8814 23.8243 6.2735 5.8319 119.5596 41.8172 2.0559 5.3789 6.4854 0.5905 3.0954 6.0920 0.6231 0.6838 1.8889 0.2923 1.0098 0.2805 4.3786 7.4979 3.9681 11.8391 19.8278 9.7326 11.7953 4.3556 111.6789 129.0225 87.1716 20.7731 1.1681 72.8883 13.1391 82.9191 58.5762 12.0962 32.5105 2.0052 6.2817 6.1246 10.1197 12.2820 20.2320 0.3937 7.9977 5.5019 3.1325 5.6731 2.6843 18.4506 6.9173 124.6872 5.3270 156.5878 13.9285 472.9550 249.3982 3.3618 34.5736 29.4919 20.0488 15.5843 35.3972 13.9576 12.2843 11.9744 42.8422 47.9651 32.0698 37.0167 15.1802 29.8506 27.7899 9.3766 33.4886 77.8677 20.2097
temp: 298.150 k
press: 1.00000 atm
elementType: 8 8 7 7 6 6 6 6 6 6 6 6 6 6 6 6 6 6 6 1 1 1 1 1 1 1 1 1 1 1 1 1 1 1 1 1 1 1 1
symmnumber: 1
zpe: 853066.6 jmol-1
zpe.correction: 0.324916 hartree
zpe.thermalcorrener: 0.343937 hartree
zpe.thermalcorrenthalpy: 0.344881 hartree
zpe.thermalcorrgfe: 0.278296 hartree
zpe.sumelectzpe: -842.159379 hartree
zpe.sumelectthermal: -842.140358 hartree
zpe.sumelectthermalent: -842.139414 hartree
zpe.sumelectthermalfe: -842.205999 hartree
dipole: 4.5775 2.8698 1.4873
dipole: 5.6037
quadrupole: -108.8539 -121.4104 -105.9807
quadrupole: 2.3705 -9.0367 -0.4730
quadrupole: 3.2278 -9.3288 6.1010 2.3705 -9.0367 -0.4730
hfenergy: -842.4842948 hartree
pointgroup: C01 [X(C15H20N2O2)]
dipole: -1.7414456 -1.3108305 0.331211 debye
polarizability: 242.5715986|2.8597923|146.4476037|3.1120588|-5.2262621|153.9488005 unknown
InChI: InChI=1S/C15H20N2O2/c1-3-10-9-13(18)17-14(19)15(10,4-2)11-5-7-12(16)8-6-11/h5-8,10,17H,3-4,9,16H2,1-2H3
charge 0 multiplicity 1
39 atoms
O  0.443526 2.60824 -0.30103
O  4.550665 0.61591 -0.915492
N  2.450956 1.515559 -0.542921
N  -5.105895 -0.386074 -0.913943
C  0.516081 0.234303 0.455413
C  1.253202 -1.017152 -0.187318
C  2.794286 -0.901152 -0.106085
C  0.824157 0.331309 1.996047
C  0.7782 -2.371175 0.403147
C  -0.991663 0.132322 0.146144
C  1.083979 1.532722 -0.167631
C  3.356612 0.436598 -0.55312
C  0.289829 1.593414 2.708649
C  1.236269 -3.595862 -0.420489
C  -1.459982 0.387515 -1.170385
C  -1.949744 -0.306931 1.093035
C  -2.807809 0.21854 -1.529234
C  -3.306659 -0.481496 0.754472
C  -3.76355 -0.219713 -0.567154
H  0.969912 -1.013691 -1.261732
H  3.281581 -1.669955 -0.7297
H  3.146875 -1.08383 0.928767
H  1.919206 0.280387 2.146964
H  0.410053 -0.570837 2.483156
H  -0.325824 -2.368198 0.454703
H  1.147699 -2.474732 1.443682
H  2.823223 2.416277 -0.871548
H  0.771958 2.511773 2.331741
H  -0.796426 1.715453 2.562351
H  0.489173 1.526188 3.794087
H  0.894386 -3.516855 -1.469749
H  2.335902 -3.708517 -0.429681
H  0.814277 -4.526864 -0.0004
H  -0.761761 0.747762 -1.935626
H  -1.649829 -0.523009 2.124024
H  -3.13078 0.435989 -2.554858
H  -4.018176 -0.819028 1.518336
H  -5.790564 -0.676446 -0.222532
H  -5.431146 -0.171047 -1.851586
