program: Gaussian 09
title: 000130640
version: EM64L-G09RevD.01
frameworkgroup: C1[X(C10H12N2O2)]
method: RPBEPBE
basis: SDD
operation: Freq
keyword: #p
keyword: freq=noraman
keyword: PBEPBE/SDD
title: #p freq=noraman PBEPBE/SDD
converged: YES YES NO NO
title: Mulliken charges:
elementType: O O N N C C C C C C C C C C H H H H H H H H H H H H
charge: -0.197322 -0.288075 -0.078392 0.068727 -0.125809 0.117631 -0.711838 0.301968 -0.644588 -0.346541 -0.345799 -0.248439 -0.223542 -0.220876 0.223671 0.223319 0.246021 0.259752 0.221810 0.268545 0.273855 0.233946 0.280686 0.234851 0.238281 0.238158
chargesum: 0.00000
title: Mulliken charges with hydrogens summed into heavy atoms:
elementType: O O N N C C C C C C C C C C
charge: -0.197322 -0.288075 -0.078392 0.068727 0.097862 0.117631 0.017254 0.301968 0.119622 -0.112594 -0.065113 -0.013589 0.014739 0.017283
polarizability: 1.94501470e+02 -6.08698335e+00 1.13729604e+02 -9.69910624e+00 1.02457717e+01 8.38138832e+01
1716.lowfreq: -10.7565 -0.0001 0.0006 0.0007 6.1275 7.3937 32.2594 41.3510 56.6287
frequency: 31.9896 41.3354 56.6087 91.5265 128.8498 146.7908 176.7192 211.1551 254.5065 269.8840 280.2091 324.5066 357.7746 394.4780 400.0590 427.0940 449.6125 474.3524 612.6218 624.6161 681.8578 698.3603 700.6665 748.7530 793.5788 806.5773 857.4421 918.1690 943.6247 954.3146 989.1265 991.4721 1012.5294 1015.9230 1028.0837 1051.2278 1083.3998 1094.7167 1103.7351 1175.4230 1181.9955 1193.0447 1221.7685 1262.2723 1277.2495 1316.0607 1343.4527 1359.9088 1386.8802 1399.4246 1406.1346 1435.6382 1449.9025 1467.6253 1477.2365 1479.6532 1493.2009 1570.5302 1597.6839 1612.3707 2974.2505 2986.7696 3012.9997 3079.2948 3102.5347 3110.8368 3125.0621 3131.8450 3140.3004 3151.1186 3160.7439 3171.6612
redmass: 5.4742 6.6651 3.6571 1.3246 2.5495 4.6648 4.3629 4.1126 1.1527 3.2287 4.6238 7.1761 3.4812 5.8175 2.7919 3.9304 6.0162 3.6871 6.3695 5.8238 4.5938 1.7237 3.3011 3.2611 2.1435 4.6793 1.2514 2.4470 1.4790 2.9466 5.5765 1.4134 1.3490 2.3217 2.0979 2.3944 1.4851 1.4735 1.5323 1.0654 2.8365 1.1274 2.4834 1.9438 3.6951 1.3555 3.9416 1.5192 8.4842 1.1940 1.2594 2.2432 1.0588 1.0468 1.0967 2.0158 1.0538 6.9072 6.7320 6.7237 1.0806 1.0331 1.0352 1.1019 1.0997 1.1004 1.1007 1.0852 1.0880 1.0923 1.0961 1.1014
irintensity: 1.5096 2.2749 0.8528 1.0187 2.4425 0.1611 3.3628 5.0446 0.6073 1.0107 2.7641 5.2966 3.7381 2.3710 0.0335 1.6076 1.5030 0.9999 0.1757 19.3322 4.9677 69.5879 7.6736 5.0801 30.9099 22.3332 1.0026 145.2793 13.2663 28.2693 0.9471 1.9892 2.3330 80.6421 1.7938 25.7613 13.1823 10.8407 49.9411 3.5765 62.9403 14.2255 125.5627 15.8037 7.9760 0.7570 162.3142 8.7064 2.2842 14.7200 46.3468 18.6222 19.6029 14.7757 13.5235 2.2851 29.3995 76.1659 45.9696 11.3344 22.0030 29.2482 12.5924 14.5685 3.0105 28.4165 8.6918 0.7402 5.4566 17.7725 17.7773 19.9629
temp: 298.150 k
press: 1.00000 atm
elementType: 8 8 7 7 6 6 6 6 6 6 6 6 6 6 1 1 1 1 1 1 1 1 1 1 1 1
symmnumber: 1
zpe: 535227.9 jmol-1
zpe.correction: 0.203858 hartree
zpe.thermalcorrener: 0.217580 hartree
zpe.thermalcorrenthalpy: 0.218524 hartree
zpe.thermalcorrgfe: 0.162283 hartree
zpe.sumelectzpe: -647.107460 hartree
zpe.sumelectthermal: -647.093737 hartree
zpe.sumelectthermalent: -647.092793 hartree
zpe.sumelectthermalfe: -647.149034 hartree
dipole: -6.3923 2.3488 2.7290
dipole: 7.3366
quadrupole: -93.1673 -79.4468 -81.5720
quadrupole: 1.5088 6.8532 0.7221
quadrupole: -8.4386 5.2819 3.1567 1.5088 6.8532 0.7221
hfenergy: -647.3113172 hartree
pointgroup: C01 [X(C10H12N2O2)]
dipole: -2.4485327 -0.6778724 -1.3699266 debye
dipolederiv: -0.782258 -0.0889012 -0.0648166 -0.1945359 -0.57606 -0.2174023 -0.167832 -0.2715938 -0.4795768 -1.2466373 0.0128197 -0.2974858 -0.6827226 -0.2988925 -0.1527308 0.0070707 0.0603812 -0.2427082 -0.8611503 -0.0628444 -0.1450855 0.3321702 -0.2098505 0.0608548 -0.4610524 -0.0252164 -0.3258643 1.5754783 -0.0346772 0.564587 0.1245491 -0.0382328 0.0510205 0.5968753 -0.0161232 0.1505888 0.3148275 0.2610649 0.0108471 0.4862882 0.0440289 -0.0030819 0.0687279 -0.0110153 0.1877165 1.7105404 0.0223242 0.0972826 -0.0384021 0.5003839 0.3155813 0.056826 0.3906849 0.3640724 -0.007709 0.0381547 0.0172642 -0.0678978 -0.0097589 0.0519397 0.0986489 -0.0002872 0.0102292 -0.8281861 -0.1069817 -0.0957686 -0.0081334 -0.047914 -0.0431292 -0.0261345 -0.0445085 -0.0432096 -0.137999 -0.0222645 -0.074024 -0.0189147 0.1405647 0.0159947 -0.0152276 0.0174201 0.1890067 0.15051 -0.0521653 -0.0571677 0.0908686 -0.0536075 0.0566364 0.0789275 0.0685132 -0.0572172 0.0409458 0.0979375 0.1056813 -0.1036884 -0.0400749 0.0647218 -0.1075226 0.0568321 -0.0296356 -0.2546433 0.0586697 0.0623563 0.1146628 -0.022277 0.1437239 0.1243064 0.1375489 -0.0078774 -0.0333563 -0.1376975 -0.1570273 -0.1420087 -0.0972216 0.0613166 -0.1436365 0.0636709 -0.078957 0.1491473 0.0297662 0.0176477 0.0110519 -0.050517 0.080539 -0.0071749 0.0803884 -0.0393662 -0.0254294 -0.0353498 -0.0565348 -0.0388215 0.0471858 0.0007194 -0.0926277 -0.0145084 -0.1118439 -0.0861518 -0.1340871 -0.0008075 -0.1370775 0.0482712 0.0117941 -0.0057289 -0.0224006 0.0864351 -0.0210698 0.1004768 0.05544 0.0999513 0.0154625 -0.038455 0.057946 -0.0259653 0.0456102 0.0976144 0.0281145 -0.0382722 -0.0246199 0.0735763 -0.0491276 -0.0409083 -0.0004462 -0.0497031 0.1061048 -0.0003711 -0.1165845 0.008964 0.0497273 -0.0514645 -0.1047053 0.0067183 -0.0848706 -0.0182287 -0.101524 0.0849847 0.0033381 0.1097098 0.0146384 -0.0175894 -0.0009047 0.1398148 0.0998565 0.1091447 0.0354239 0.1242277 0.0156921 0.0046877 0.002586 -0.0724923 0.0229377 0.0059973 0.070452 0.0840151 0.0833267 0.0730728 -0.060084 0.1043833 -0.0623495 0.0689561 0.1321745 -0.0390225 -0.0395767 0.0011689 0.0821155 -0.0738472 -0.0098679 -0.0695581 0.0748934 0.0578745 -0.033035 -0.0318209 -0.0543412 0.0402252 -0.1256725 -0.0490812 -0.1256723 0.025022 -0.0310239 0.0573608 0.0688681 0.0687032 0.0826477 -0.0830431 0.0820323 -0.0835541 0.0651281 -0.1072283 -0.0373643 -0.029426 -0.0381071 0.1217432 -0.0361302 -0.029241 -0.0355623 0.1204189 unknown
polarizability: 193.0987221|10.5448437|103.1743756|10.4175766|18.9532956|95.7718594 unknown
InChI: InChI=1S/C10H12N2O2/c1-8(12(2)11-14)10(13)9-6-4-3-5-7-9/h3-8H,1-2H3
charge 0 multiplicity 1
26 atoms
O  0.413934 1.305566 1.235889
O  4.580742 0.58923 0.378751
N  2.463569 0.336786 -0.350611
N  3.525315 -0.143057 0.407953
C  1.204834 -0.426316 -0.300264
C  0.09476 0.397089 0.418709
C  1.361931 -1.795437 0.411483
C  -1.344738 0.066336 0.146646
C  2.531273 1.607807 -1.089791
C  -1.761248 -0.874438 -0.836111
C  -2.333183 0.744827 0.913215
C  -3.133629 -1.127253 -1.045098
C  -3.701926 0.490123 0.705129
C  -4.106692 -0.447368 -0.276138
H  0.892335 -0.604852 -1.349621
H  0.406699 -2.345289 0.364854
H  2.147541 -2.39476 -0.076117
H  1.645503 -1.660541 1.466583
H  2.088036 1.484287 -2.093729
H  3.595254 1.885201 -1.173244
H  1.995429 2.403045 -0.54133
H  -1.027715 -1.411659 -1.446366
H  -1.995975 1.466688 1.664464
H  -3.445043 -1.851161 -1.805689
H  -4.453631 1.017497 1.302045
H  -5.171574 -0.64575 -0.44061
