program: Gaussian 09
title: 000130655
version: EM64L-G09RevD.01
frameworkgroup: C1[X(C12H16N2O3)]
method: RPBEPBE
basis: SDD
operation: Freq
keyword: #p
keyword: freq=noraman
keyword: PBEPBE/SDD
title: #p freq=noraman PBEPBE/SDD
converged: YES YES NO NO
title: Mulliken charges:
elementType: O O O N N C C C C C C C C C C C C H H H H H H H H H H H H H H H H
charge: -0.207728 -0.206667 -0.253695 -0.442373 -0.012326 0.296122 0.296219 -0.639793 -0.752629 -0.721902 -0.736327 0.231776 0.485820 -0.373760 -0.283152 -0.307091 -0.337185 0.279458 0.242791 0.215183 0.244241 0.248385 0.221089 0.236385 0.250498 0.231171 0.227950 0.235799 0.316308 0.224985 0.302078 0.244277 0.244093
chargesum: 0.00000
title: Mulliken charges with hydrogens summed into heavy atoms:
elementType: O O O N N C C C C C C C C C C C C
charge: -0.207728 -0.206667 -0.253695 -0.126065 -0.012326 0.296122 0.296219 -0.117543 -0.044820 -0.013929 -0.041408 0.231776 0.485820 -0.148774 0.018926 -0.062815 -0.093092
polarizability: 2.12848124e+02 -3.55950013e+00 1.48809927e+02 1.14783917e+00 6.62665455e+00 1.00223243e+02
1716.lowfreq: -20.2832 -11.1865 -6.7720 -0.0005 -0.0003 0.0002 7.4333 38.2146 50.8614
frequency: -6.6825 38.1677 50.6957 82.5530 88.5259 118.4196 145.1548 165.8676 221.7308 232.6711 239.9472 250.3888 271.5096 283.1756 328.1476 337.8317 343.2444 367.9055 375.0799 377.1178 455.4171 486.8878 520.5900 537.7651 582.6961 626.2718 658.2006 658.6281 680.7681 713.6125 740.7100 748.6208 818.8000 830.2023 835.0458 840.5865 878.6090 905.3312 922.4499 936.2675 939.9576 956.1854 957.4335 977.0845 986.1067 987.6103 1057.7426 1071.0768 1090.4719 1099.5511 1139.8140 1172.7781 1203.0772 1211.2016 1218.7500 1264.1829 1266.6883 1309.1614 1312.8644 1328.6791 1336.2648 1373.6196 1382.1652 1387.8494 1401.6776 1435.7097 1450.6224 1459.0494 1464.8391 1468.8023 1477.2715 1477.6680 1486.3071 1495.1167 1577.6666 1584.9396 1623.6128 2988.2402 2989.9129 2992.5526 2996.4996 3045.8274 3084.2204 3087.0166 3091.8136 3096.1416 3106.1018 3114.0190 3122.3067 3139.3117 3148.5099 3208.9765 3518.4760
redmass: 4.7989 4.0332 4.6617 5.7091 4.6170 4.3751 1.1591 4.1699 2.7320 1.9400 1.2608 4.7417 3.2195 1.7143 2.5066 4.2019 3.4490 2.2246 2.5720 3.6968 2.5146 3.5250 3.4281 4.2381 3.5233 4.1823 2.7843 1.6052 3.8191 7.6405 3.3161 4.0645 9.9391 1.5269 4.5097 3.2096 1.2603 2.7522 1.6807 1.9795 2.9254 1.4152 6.7184 1.6977 1.3926 1.3127 2.1196 1.9582 1.5522 1.7004 2.0192 2.8075 3.4389 1.9877 1.3296 2.1979 2.7597 2.6848 3.1633 2.1562 1.7746 1.2808 1.2326 1.2120 1.9763 1.0866 1.0521 1.0538 1.8525 1.0825 1.0558 1.1026 2.4260 1.0734 5.2353 4.7160 4.7510 1.0582 1.0354 1.0382 1.0367 1.0980 1.0994 1.0990 1.0984 1.1004 1.1000 1.0990 1.0881 1.0908 1.0980 1.0950 1.0765
irintensity: 0.0595 2.5831 3.5802 4.6061 4.4771 2.6989 0.8425 4.5004 2.5176 3.8244 0.2013 0.6414 0.9066 1.7328 5.7561 0.6408 3.8570 1.1898 0.0836 6.5708 1.3083 5.5064 30.2749 20.3721 6.1295 6.2136 15.2167 33.0748 0.6832 4.9921 0.9477 11.4917 1.0334 84.6361 9.9458 11.1777 5.3132 0.0658 3.0652 8.9713 3.1860 1.5772 4.4365 0.8859 2.4741 0.0375 0.2217 49.9581 4.8947 10.6488 87.2790 51.9696 53.5252 25.6520 13.6585 8.1487 0.6117 18.6458 42.5878 3.8333 116.5119 22.5937 39.0952 46.4801 64.7702 20.3658 1.3673 25.3238 0.5966 4.0155 5.6073 37.8883 374.4895 49.4473 242.4667 63.7597 76.9991 13.0443 14.3809 19.4306 7.3575 7.4209 6.4684 14.8715 33.2862 17.9917 13.0131 22.1559 8.5253 30.4597 16.0925 4.9890 15.8508
temp: 298.150 k
press: 1.00000 atm
elementType: 8 8 8 7 7 6 6 6 6 6 6 6 6 6 6 6 6 1 1 1 1 1 1 1 1 1 1 1 1 1 1 1 1
symmnumber: 1
zpe: 692991.4 jmol-1
zpe.correction: 0.263946 hartree
zpe.thermalcorrener: 0.280019 hartree
zpe.thermalcorrenthalpy: 0.280963 hartree
zpe.thermalcorrgfe: 0.220632 hartree
zpe.sumelectzpe: -800.682842 hartree
zpe.sumelectthermal: -800.666769 hartree
zpe.sumelectthermalent: -800.665825 hartree
zpe.sumelectthermalfe: -800.726157 hartree
dipole: 1.1771 -1.7736 -0.3931
dipole: 2.1647
quadrupole: -138.1426 -92.9208 -99.9341
quadrupole: -18.1053 -3.1855 1.1908
quadrupole: -27.8101 17.4117 10.3984 -18.1053 -3.1855 1.1908
hfenergy: -800.9467884 hartree
pointgroup: C01 [X(C12H16N2O3)]
dipole: 0.441525 0.7242517 -0.0762634 debye
polarizability: 211.6410861|4.0352732|148.8724748|-10.8503403|-7.4434496|101.3677329 unknown
InChI: InChI=1S/C12H16N2O3/c1-11(2)12(3,17-16-11)8-10(15)14-9-4-6-13-7-5-9/h4-7,14H,8H2,1-3H3
charge 0 multiplicity 1
33 atoms
O  -3.695539 1.383215 -0.058586
O  -4.511726 0.185678 0.548136
O  -0.069834 -1.041124 0.065579
N  1.202471 0.915642 -0.182619
N  5.241617 -0.489065 -0.329648
C  -2.538306 0.412665 -0.317825
C  -3.182308 -0.590052 0.70853
C  -1.23221 1.128903 0.063167
C  -2.568656 -0.019918 -1.785332
C  -3.366983 -2.046019 0.297206
C  -2.71618 -0.44769 2.160747
C  -0.000228 0.219643 -0.028575
C  2.524761 0.400831 -0.226647
C  3.596847 1.325395 -0.352214
C  2.835987 -0.982797 -0.154025
C  4.917856 0.837855 -0.398419
C  4.195376 -1.360969 -0.209957
H  -1.310645 1.509221 1.098977
H  -1.119551 2.015289 -0.592262
H  -2.293233 0.830398 -2.435118
H  -1.866257 -0.851354 -1.970381
H  -3.585817 -0.340276 -2.063751
H  -4.07332 -2.543073 0.986524
H  -3.763628 -2.140738 -0.725426
H  -2.396009 -2.568874 0.3548
H  -2.751204 0.605942 2.486809
H  -3.391963 -1.021913 2.818317
H  -1.6927 -0.844026 2.28628
H  1.125835 1.933709 -0.256965
H  3.411512 2.404719 -0.411474
H  2.044221 -1.725881 -0.058486
H  5.760296 1.531901 -0.494027
H  4.466318 -2.421439 -0.156336
