program: Gaussian 09
title: 000010489
version: EM64L-G09RevD.01
frameworkgroup: C1[X(C5H10Cl2)]
method: RPBEPBE
basis: SDD
operation: Freq
keyword: #pfreq=noraman
keyword: PBEPBE/SDD
title: #p freq=noraman PBEPBE/SDD
converged: NO YES NO NO
title: Mulliken charges:
elementType: Cl Cl C C C C C H H H H H H H H H H
charge: -0.094672 -0.094376 0.018362 -0.303160 -0.662543 -0.636687 -0.651674 0.295651 0.229650 0.244754 0.235502 0.233507 0.236062 0.233445 0.237822 0.238077 0.240278
chargesum: 0.00000
title: Mulliken charges with hydrogens summed into heavy atoms:
elementType: Cl Cl C C C C C
charge: -0.094672 -0.094376 0.018362 -0.007508 0.047363 0.066327 0.064504
polarizability: 9.00022049e+01 8.77656709e+00 7.08107572e+01 -3.89645411e+00 -1.60555454e+00 5.93737613e+01
1716.lowfreq: -12.5708 -4.5238 -0.0033 -0.0021 0.0007 11.6363 76.4912 181.4753 207.3609
frequency: 76.4500 181.4681 207.3355 229.5744 238.1901 247.1880 277.5735 301.2887 321.1972 334.7904 389.8752 487.0367 543.5818 605.9184 747.9610 926.1387 935.7200 994.3260 1000.2437 1058.2409 1104.5492 1106.5700 1178.8752 1222.5315 1264.1642 1336.8847 1381.5719 1393.2089 1397.6929 1451.0183 1457.4222 1465.6797 1470.1751 1471.8065 1490.1471 2994.6749 2998.9967 3002.6472 3081.2799 3092.8593 3099.1263 3101.5631 3109.4782 3114.3587 3119.1133
redmass: 3.9252 3.4532 1.2631 1.5201 1.9542 1.6839 1.5649 2.5210 3.4141 3.9352 2.5635 3.0507 4.0579 3.4428 2.9653 1.9920 1.4517 1.2732 1.4352 1.4936 1.8988 1.9996 1.6675 1.7012 2.9835 1.4931 1.2332 1.2204 1.1934 1.0500 1.0477 1.0517 1.0534 1.0478 1.0527 1.0372 1.0357 1.0360 1.0889 1.0968 1.0990 1.0984 1.1010 1.1001 1.1000
irintensity: 3.9083 7.4069 0.8786 0.0947 0.1732 0.3901 0.1792 0.6175 3.8464 4.3811 3.2507 0.4245 68.7630 11.5924 0.2718 11.1326 0.9205 2.1565 9.2202 28.5027 22.7077 42.6654 8.1490 9.0210 7.0380 1.7943 28.0870 36.1827 16.2837 6.1539 1.7098 4.5557 19.4687 25.7682 4.4855 9.6326 10.6607 8.4280 2.0316 6.7516 10.1238 13.5367 6.6551 41.4968 13.6817
temp: 298.150 k
press: 1.00000 atm
elementType: 17 17 6 6 6 6 6 1 1 1 1 1 1 1 1 1 1
symmnumber: 1
zpe: 364923.8 jmol-1
zpe.correction: 0.138992 hartree
zpe.thermalcorrener: 0.148255 hartree
zpe.thermalcorrenthalpy: 0.149199 hartree
zpe.thermalcorrgfe: 0.105011 hartree
zpe.sumelectzpe: -1116.081952 hartree
zpe.sumelectthermal: -1116.072689 hartree
zpe.sumelectthermalent: -1116.071744 hartree
zpe.sumelectthermalfe: -1116.115933 hartree
dipole: 0.0473 -0.0894 0.6476
dipole: 0.6555
quadrupole: -67.2484 -54.3780 -55.8070
quadrupole: -2.4815 0.7439 -0.4517
quadrupole: -8.1039 4.7665 3.3375 -2.4815 0.7439 -0.4517
hfenergy: -1116.2209438 hartree
pointgroup: C01 [X(C5H10Cl2)]
dipole: -0.0430254 -0.0217312 -0.2533322 debye
dipolederiv: -0.5229323 0.2605855 0.1013562 0.2011465 -0.5322707 -0.1182278 0.0677068 -0.1083591 -0.2978576 -0.5188197 0.2431501 0.0079152 0.2058361 -0.5106262 -0.0018702 0.0187061 -0.0328528 -0.1951203 0.5197486 -0.2605325 -0.1182885 -0.1963482 0.5481791 0.1469787 -0.0608543 0.1044283 0.4045927 0.5908001 -0.2851487 -0.0414577 -0.2698475 0.5473865 -0.0207429 -0.0417425 0.0111699 0.1181688 -0.0744523 0.0351757 0.0116388 0.0246545 -0.0440022 -0.0231988 -0.0199528 -0.0087732 -0.1910564 -0.0846171 -0.0257838 0.035384 -0.0416077 -0.1488948 0.0453482 0.0331021 0.0210588 -0.0311026 -0.1247524 -0.0148724 0.0279348 -0.0407625 -0.1738819 0.0587288 0.0270376 0.0291375 0.0256713 -0.0000865 0.0389722 0.0281235 0.0300366 0.0035833 0.0089862 -0.0035465 0.00768 -0.0838762 0.0405708 0.0990234 0.0595361 0.089312 0.0128572 -0.0491285 0.0480402 -0.0421506 0.0548423 0.1034376 -0.0510999 0.0324105 -0.0418341 -0.0658688 0.0990604 0.0408357 0.0604318 0.040607 -0.0889366 -0.0701075 -0.0785714 -0.0712542 0.0846583 -0.0204226 -0.031228 -0.014424 0.0760893 0.0636786 0.0957563 0.0468936 0.071961 -0.0315541 -0.0395129 0.0445032 -0.0399385 0.0789946 -0.1022193 -0.06648 -0.0448098 -0.0222487 0.0880313 0.0029253 -0.0702162 0.0042897 0.0816536 0.1044662 -0.0139813 -0.0365689 -0.0009027 0.0787307 -0.0320572 -0.0181468 0.0193579 -0.1279437 0.0563124 0.1112944 0.0308159 0.0921679 -0.0216813 -0.0089036 0.0222865 -0.0004843 0.100704 0.1141697 -0.0127154 0.0139883 0.0131477 0.0797487 -0.0435525 0.0317312 0.003856 -0.1089435 -0.0763677 -0.083236 -0.0763006 -0.0434567 0.0856049 -0.0044107 -0.0882622 -0.0144274 0.0545767 unknown
polarizability: 80.3650868|-12.7901085|80.0204273|-4.1201919|3.8893462|59.8012093 unknown
InChI: InChI=1S/C5H10Cl2/c1-4(6)5(2,3)7/h4H,1-3H3
charge 0 multiplicity 1
17 atoms
Cl -1.791173 1.230187 0.577164
Cl 2.038397 -1.17002 0.157369
C  -0.595118 -0.20064 -0.041554
C  0.783413 0.266887 0.491239
C  -0.720994 -0.242364 -1.567104
C  -1.114458 -1.471631 0.643423
C  1.38476 1.533303 -0.116139
H  0.754664 0.307181 1.591538
H  -0.004107 -0.984678 -1.966049
H  -0.508323 0.73597 -2.025929
H  -1.740558 -0.546054 -1.855603
H  -0.524427 -2.341957 0.305152
H  -2.172987 -1.635968 0.383301
H  -1.030688 -1.398051 1.740924
H  0.699489 2.384083 0.048348
H  1.558961 1.419949 -1.198616
H  2.350349 1.759701 0.364735
