program: Gaussian 09
title: 000130690
version: EM64L-G09RevD.01
frameworkgroup: C1[X(C19H17Cl2NO4)]
method: RPBEPBE
basis: SDD
operation: Freq
keyword: #p
keyword: freq=noraman
keyword: PBEPBE/SDD
title: #p freq=noraman PBEPBE/SDD
converged: YES YES NO NO
title: Mulliken charges:
elementType: Cl Cl O O O O N C C C C C C C C C C C C C C C C C C C H H H H H H H H H H H H H H H H H
charge: -0.066256 -0.067688 -0.371432 -0.192497 -0.289717 -0.388221 -0.128299 -0.552926 0.605903 0.293313 0.170148 -0.575592 -0.327769 -0.330669 -0.718177 0.203058 0.012368 0.342932 -0.289366 0.036346 -0.583228 -0.569895 0.140185 -0.421511 -0.351060 -0.191499 0.243514 0.225194 0.311914 0.243897 0.235411 0.236711 0.235464 0.234956 0.291868 0.263368 0.274115 0.264694 0.292152 0.264367 0.241792 0.364051 0.388081
chargesum: 0.00000
title: Mulliken charges with hydrogens summed into heavy atoms:
elementType: Cl Cl O O O O N C C C C C C C C C C C C C C C C C C C
charge: -0.066256 -0.067688 -0.007381 -0.192497 -0.289717 -0.000140 -0.128299 -0.084218 0.605903 0.293313 0.170148 -0.263679 0.151540 0.141506 -0.483221 0.203058 0.012368 0.342932 -0.289366 0.036346 -0.027992 -0.031086 0.140185 -0.129359 -0.086693 0.050293
polarizability: 3.92651052e+02 2.80988103e+01 2.79787843e+02 -2.47542966e+01 -9.57189426e+00 1.60555244e+02
1716.lowfreq: -3.5291 -0.0027 -0.0023 -0.0016 4.3994 6.7879 11.2552 16.4161 19.3585
frequency: 11.1858 16.1843 19.2159 32.5124 41.0012 53.0953 77.6333 91.6292 96.8474 116.2047 120.1285 158.4354 176.4916 191.7821 195.2551 212.2715 225.0603 239.4032 248.6845 294.6401 301.2334 308.5061 335.2267 362.8000 368.3166 413.7455 428.3437 429.2811 433.3452 444.8275 449.6064 474.0589 486.0699 502.3002 537.6576 552.7583 570.0104 580.7562 619.3258 655.9129 663.7867 674.0660 694.0772 722.8295 734.8200 759.9705 771.9745 777.9148 797.5676 806.7149 832.3008 856.3612 871.8414 887.2968 931.3072 948.0838 955.2221 971.9701 975.7204 994.9536 999.1133 1004.6536 1011.9355 1043.2766 1059.6166 1063.0437 1070.8056 1095.4066 1113.6146 1118.6503 1165.2303 1174.0841 1181.0370 1182.2914 1222.6116 1235.4838 1246.6731 1251.1063 1257.9052 1273.7402 1282.6822 1291.2955 1295.0906 1309.3019 1324.9929 1344.9467 1362.1036 1364.0417 1371.9197 1405.8832 1408.5537 1423.2414 1441.6874 1448.2931 1451.9102 1453.2948 1463.8206 1474.2061 1479.7110 1482.0506 1536.3325 1549.8046 1575.2354 1589.2832 1609.2151 1628.9605 2680.8826 2881.0190 2940.0379 2949.0125 3003.8573 3052.1939 3055.8065 3059.7018 3062.2706 3098.5705 3145.7873 3146.5570 3147.5099 3168.2156 3169.3898 3179.9933 3532.6329
redmass: 9.7914 11.8565 9.0712 10.2310 8.4223 6.8107 2.5273 2.6547 4.8001 4.4356 9.4292 5.9157 5.5744 4.6148 4.6620 4.6222 6.6015 5.0606 3.5174 3.4916 6.4588 5.7398 4.5833 5.9865 5.7011 5.3301 2.1169 6.7955 2.3227 2.7429 6.1619 6.8112 4.5927 4.4751 8.0012 5.0579 5.1135 4.8936 6.1735 3.7733 6.5380 5.9585 5.5676 3.0101 5.4950 5.8836 1.1313 1.1450 8.2188 1.7339 3.6161 2.1963 2.6325 5.6359 1.4183 3.9031 2.2167 1.0653 2.6217 1.9327 1.4250 1.4403 1.9362 2.9453 3.4353 3.4339 2.1235 1.8453 2.3625 1.6417 1.5567 1.2958 1.4879 1.4219 1.7213 1.4609 1.4179 1.4543 1.3133 1.3049 2.4682 1.4658 3.5534 1.3595 5.2214 3.0432 1.3479 1.6710 1.4955 5.4489 4.9138 4.2348 2.9558 3.5068 1.0946 1.1003 1.1458 1.1490 1.5158 1.6202 4.1863 6.6010 4.1968 6.2209 6.2813 6.3526 1.0711 1.0705 1.0682 1.0680 1.0874 1.0915 1.0755 1.0602 1.0746 1.0910 1.1118 1.0878 1.1119 1.0911 1.0924 1.0984 1.0658
irintensity: 0.0159 0.0800 0.6434 1.2111 2.1697 3.8943 2.0102 1.9276 0.8371 0.9676 0.3016 0.2017 0.7592 2.7088 5.4376 0.6641 3.4848 0.2097 0.5755 0.9444 3.9641 3.8044 2.7842 15.8813 5.2461 20.6333 46.5485 4.8227 44.5000 44.5006 14.1652 2.9064 9.7597 6.4312 0.3579 2.0940 1.7723 3.0537 4.1243 23.6693 100.3918 85.4341 0.1409 3.0828 2.1187 11.5807 6.2826 10.6016 20.0177 71.3534 18.4833 7.5871 20.7534 16.0637 0.5567 12.7368 3.2003 124.2638 52.7495 41.0383 7.6421 5.6863 12.2953 7.8821 3.8004 9.6717 40.0150 50.8561 68.9955 35.7704 7.5350 70.5735 38.4026 11.3574 85.9594 31.8249 19.9595 41.5560 12.1477 3.1382 461.5503 35.0607 63.3355 18.2821 385.5672 64.2231 1.1444 4.1367 7.4797 8.3599 9.5610 78.7120 17.8829 225.3668 1.8070 6.1226 5.1250 18.2539 39.4444 8.5954 64.4080 178.8986 43.8989 60.0465 52.5324 53.1034 205.4676 73.0617 43.2017 68.5857 9.8623 9.2791 7.3607 28.5767 25.0013 15.5195 12.6325 10.0637 21.1280 1.7810 0.0962 14.1127 40.9958
temp: 298.150 k
press: 1.00000 atm
elementType: 17 17 8 8 8 8 7 6 6 6 6 6 6 6 6 6 6 6 6 6 6 6 6 6 6 6 1 1 1 1 1 1 1 1 1 1 1 1 1 1 1 1 1
symmnumber: 1
zpe: 842841.5 jmol-1
zpe.correction: 0.321021 hartree
zpe.thermalcorrener: 0.345068 hartree
zpe.thermalcorrenthalpy: 0.346012 hartree
zpe.thermalcorrgfe: 0.262884 hartree
zpe.sumelectzpe: -2008.131312 hartree
zpe.sumelectthermal: -2008.107265 hartree
zpe.sumelectthermalent: -2008.106321 hartree
zpe.sumelectthermalfe: -2008.189449 hartree
dipole: 1.7238 3.0996 -1.6292
dipole: 3.9030
quadrupole: -187.9158 -149.1867 -180.8491
quadrupole: 27.6249 -1.2271 -7.0624
quadrupole: -15.2653 23.4638 -8.1985 27.6249 -1.2271 -7.0624
hfenergy: -2008.4523329 hartree
pointgroup: C01 [X(C19H17Cl2N1O4)]
dipole: 0.7962475 -1.2746526 0.3148978 debye
polarizability: 397.4187761|-22.5046286|271.3743352|17.8285228|22.6454322|164.2010278 unknown
InChI: InChI=1S/C19H17Cl2NO4/c20-4-6-22(7-5-21)10-11-8-13-17(15(24)9-11)19(26)16-12(18(13)25)2-1-3-14(16)23/h1-3,8-9,23-24H,4-7,10H2
charge 0 multiplicity 1
43 atoms
Cl 3.792729 1.570306 -3.874389
Cl 6.434744 1.624839 2.689117
O  -1.035019 -3.670811 -0.468037
O  -0.321813 2.282487 0.717932
O  -3.287615 -2.251543 -0.368297
O  -5.423384 -0.938047 -0.281631
N  3.985778 -0.186218 -0.12496
C  3.298444 -1.374426 0.411111
C  1.78217 -1.329494 0.234189
C  -0.335605 -0.093064 0.287613
C  -1.088386 -1.280116 -0.002597
C  1.067632 -0.122874 0.404139
C  3.994933 -0.051576 -1.597349
C  5.218979 0.21523 0.583096
C  1.061879 -2.504109 -0.059784
C  -0.352722 -2.495229 -0.176792
C  -3.226764 0.093307 0.088335
C  -2.492559 1.285942 0.374325
C  -1.009294 1.237915 0.478575
C  -2.562594 -1.206923 -0.109667
C  3.693793 1.401941 -1.991712
C  4.866918 1.185623 1.721254
C  -4.660823 0.167113 -0.00938
C  -3.16036 2.51347 0.55827
C  -5.320668 1.413021 0.179116
C  -4.573379 2.569363 0.459505
H  3.518429 -1.42721 1.496056
H  3.691807 -2.3220 -0.030326
H  1.596006 0.809048 0.622615
H  3.21088 -0.702043 -2.02333
H  4.963428 -0.366979 -2.044338
H  5.903582 0.718623 -0.122701
H  5.770406 -0.657431 0.995261
H  1.604133 -3.449371 -0.206304
H  2.676066 1.703812 -1.707277
H  4.434999 2.113203 -1.596631
H  4.462074 2.135576 1.343825
H  4.180088 0.741817 2.458011
H  -2.564684 3.404727 0.774832
H  -6.411198 1.435277 0.098582
H  -5.091636 3.52325 0.602534
H  -0.400543 -4.427836 -0.563662
H  -4.75965 -1.735289 -0.384429
