program: Gaussian 09
title: 000130624
version: EM64L-G09RevD.01
frameworkgroup: C1[X(C15H16O)]
method: RPBEPBE
basis: SDD
operation: Freq
keyword: #pfreq=noraman
keyword: PBEPBE/SDD
title: #p freq=noraman PBEPBE/SDD
converged: YES YES NO NO
title: Mulliken charges:
elementType: O C C C C C C C C C C C C C C C H H H H H H H H H H H H H H H H
charge: -0.252240 -0.261179 0.295466 -0.352194 0.283021 0.252216 -0.612493 0.248627 -0.709910 0.401642 -0.654531 0.198906 -0.476986 -0.438210 -0.828655 -0.827805 0.238648 0.229113 0.224121 0.238529 0.236052 0.226822 0.217573 0.235255 0.247839 0.238880 0.238108 0.238276 0.237836 0.235690 0.224825 0.226761
chargesum: 0.00000
title: Mulliken charges with hydrogens summed into heavy atoms:
elementType: O C C C C C C C C C C C C C C C
charge: -0.252240 -0.022531 0.295466 0.101040 0.283021 0.252216 -0.373964 0.248627 -0.029464 0.401642 -0.419276 0.198906 -0.229147 -0.199330 -0.114436 -0.140529
polarizability: 2.68386687e+02 1.01795264e+01 1.91714568e+02 -5.93372143e+00 3.55088216e+00 8.97163172e+01
1716.lowfreq: -7.6251 -5.3657 -2.7646 -0.0004 0.0004 0.0005 58.8675 81.5657 100.1250
frequency: 58.7682 81.5539 100.1154 111.5765 122.9171 126.8652 182.1304 209.3356 235.1434 250.5312 272.8738 280.5371 317.0681 335.6790 377.9448 385.9311 401.8429 458.4490 508.3355 544.2039 581.0358 623.8486 651.4513 688.9356 703.5494 724.0484 741.7087 756.8778 788.5572 797.5490 867.6356 870.9991 891.6860 893.7504 937.2139 940.0398 942.5436 962.9816 984.6657 1027.6049 1035.7108 1039.3562 1048.7767 1072.8986 1093.8974 1103.7546 1125.6408 1169.6125 1195.9892 1208.9418 1233.8357 1258.6882 1296.6394 1311.5523 1315.4106 1341.2266 1352.9559 1380.1345 1388.4936 1392.9474 1399.2807 1426.0425 1461.4568 1466.9715 1469.6590 1471.7314 1475.8109 1479.2595 1482.6434 1485.6866 1532.9797 1556.0815 1583.4154 1626.9194 2960.2672 2976.4470 2983.1471 3000.5632 3018.0714 3029.1561 3062.3774 3073.6744 3075.0577 3082.4319 3086.1366 3096.7525 3097.7816 3132.3844 3164.2719 3199.8359
redmass: 2.9861 2.5202 1.2456 2.1371 3.1175 1.2764 2.9720 3.3666 1.2522 3.1685 2.4509 3.7072 3.0154 5.9240 3.3531 3.2044 3.2831 3.6301 4.0384 3.4687 3.8323 3.2734 4.8033 4.4890 5.6400 3.6284 2.7797 5.7335 4.0860 1.5741 1.7089 1.8492 4.6351 1.3917 1.7459 1.9491 1.4432 3.2756 1.7308 1.6384 1.4951 1.5682 1.3233 2.5459 2.1568 2.3152 1.8257 2.3874 1.3164 1.5044 2.3040 2.2116 1.6966 1.5696 2.8872 1.4824 2.5112 2.1202 1.2147 1.2155 1.4096 3.5763 2.1515 1.0485 1.0854 1.0467 1.0582 1.2455 1.1258 1.3504 4.4459 5.5912 8.8613 7.5392 1.0382 1.0352 1.0372 1.0763 1.0715 1.0976 1.0971 1.1000 1.0963 1.0994 1.0894 1.0991 1.1051 1.0880 1.0918 1.1000
irintensity: 0.1675 0.3152 2.6610 4.2474 1.2876 0.3571 0.8763 0.5279 0.9372 4.0387 2.2274 1.3476 0.2148 0.6266 3.2953 1.0972 2.8954 1.8168 0.7984 0.9304 2.8093 0.7517 0.3212 4.9405 28.6610 0.5792 11.0554 0.8581 8.7587 40.8730 17.6699 21.0156 29.5649 0.2647 3.6234 11.1454 7.7564 69.6934 3.0961 2.5057 3.4246 7.3791 13.7718 46.2300 37.1215 35.3924 14.1908 47.1364 10.0478 2.6617 43.6994 30.1817 3.8151 1.9388 0.6312 8.1524 11.4080 46.4664 14.3642 25.3128 10.9744 29.4537 16.2397 15.2296 30.5274 13.9871 18.9277 4.1978 0.4210 0.6022 25.2709 47.6972 111.3515 202.7889 59.6229 35.9086 24.3511 13.1114 91.0436 28.2176 15.0797 47.4497 19.1102 11.1285 26.1572 16.5755 34.4107 7.2673 17.6983 15.4045
temp: 298.150 k
press: 1.00000 atm
elementType: 8 6 6 6 6 6 6 6 6 6 6 6 6 6 6 6 1 1 1 1 1 1 1 1 1 1 1 1 1 1 1 1
symmnumber: 1
zpe: 694200.4 jmol-1
zpe.correction: 0.264407 hartree
zpe.thermalcorrener: 0.279127 hartree
zpe.thermalcorrenthalpy: 0.280071 hartree
zpe.thermalcorrgfe: 0.223293 hartree
zpe.sumelectzpe: -655.246640 hartree
zpe.sumelectthermal: -655.231920 hartree
zpe.sumelectthermalent: -655.230976 hartree
zpe.sumelectthermalfe: -655.287755 hartree
dipole: 1.8606 -1.3582 -0.2853
dipole: 2.3212
quadrupole: -86.4432 -87.0312 -98.4532
quadrupole: -7.2665 -2.0172 1.3234
quadrupole: 4.1993 3.6113 -7.8107 -7.2665 -2.0172 1.3234
hfenergy: -655.5110473 hartree
pointgroup: C01 [X(C15H16O1)]
dipole: -0.7291741 0.5324341 -0.137225 debye
polarizability: 268.5225833|9.9958278|190.9993873|5.0859726|-8.5959676|90.2956016 unknown
InChI: InChI=1S/C15H16O/c1-9-4-5-12-10(2)6-15-14(7-13(9)12)11(3)8-16-15/h4-7,11H,8H2,1-3H3
charge 0 multiplicity 1
32 atoms
O  -2.900285 -1.250712 -0.139115
C  -2.767123 1.177983 -0.282965
C  -1.37866 0.524001 -0.231963
C  -3.682262 -0.042682 -0.561221
C  -1.53959 -0.879584 -0.089925
C  1.143426 0.740409 -0.133155
C  -0.168909 1.236623 -0.25153
C  1.590081 -0.683823 0.074552
C  -3.116117 1.900357 1.043448
C  0.791822 -1.859691 0.183649
C  -0.618709 -1.933308 0.100559
C  2.322799 1.558537 -0.180545
C  3.011356 -0.646193 0.144795
C  3.444391 0.703364 -0.010571
C  1.520769 -3.182584 0.397319
C  2.368545 3.055803 -0.375223
H  -2.835239 1.90336 -1.115561
H  -4.615295 -0.048376 0.024681
H  -3.908144 -0.16374 -1.636589
H  -0.25659 2.326558 -0.376009
H  -3.112279 1.186967 1.887558
H  -2.376803 2.690438 1.266604
H  -4.115394 2.37142 0.988404
H  -1.078003 -2.92513 0.185392
H  3.666545 -1.505538 0.291467
H  4.485076 1.039038 -0.000498
H  2.128679 -3.15215 1.320357
H  2.212577 -3.392121 -0.4395
H  0.815504 -4.025014 0.478434
H  3.411205 3.417579 -0.361747
H  1.822203 3.598218 0.421537
H  1.925323 3.364494 -1.342441
