program: Gaussian 09
title: 000130591
version: EM64L-G09RevD.01
frameworkgroup: C1[X(C12H13N5O4)]
method: RPBEPBE
basis: SDD
operation: Freq
keyword: #p
keyword: freq=noraman
keyword: PBEPBE/SDD
title: #p freq=noraman PBEPBE/SDD
converged: YES YES NO NO
title: Mulliken charges:
elementType: O O O O N N N N N C C C C C C C C C C C C H H H H H H H H H H H H H
charge: -0.286702 -0.436538 -0.410800 -0.216713 -0.228600 -0.350175 -0.020960 -0.273949 -0.104293 -0.080054 -0.489609 -0.126321 -0.039867 -0.370367 0.341065 -0.219360 -0.156590 0.194714 0.149794 -0.151283 -0.319794 0.290781 0.253188 0.259520 0.232524 0.244280 0.184244 0.238922 0.265925 0.347890 0.396198 0.341513 0.286190 0.255225
chargesum: 0.00000
title: Mulliken charges with hydrogens summed into heavy atoms:
elementType: O O O O N N N N N C C C C C C C C C C C C
charge: -0.286702 -0.088648 -0.069287 -0.216713 -0.228600 0.046023 -0.020960 -0.273949 -0.104293 0.210728 0.023100 0.106202 0.204414 0.052799 0.341065 0.046565 -0.156590 0.194714 0.149794 0.134907 -0.064569
polarizability: 2.21226788e+02 -2.10379394e+01 1.88119838e+02 -2.00243534e+01 -7.62550875e+00 1.09630381e+02
1716.lowfreq: -5.0759 -0.0008 -0.0005 -0.0005 4.6780 8.4302 14.0587 22.8802 37.0175
frequency: 12.7424 22.5907 36.9708 88.9470 99.8595 109.3063 130.0401 166.3198 169.8064 219.3401 255.3834 267.9720 283.7703 290.9669 298.2737 302.8515 321.1899 345.1267 361.5077 415.0963 448.2179 457.3714 490.8798 522.4084 580.7639 600.2885 617.3587 628.1489 657.8417 674.9395 681.0917 693.9327 737.5861 748.8117 755.9204 764.8460 780.6214 791.5442 794.3634 851.2274 856.2865 880.1352 925.5919 931.6321 954.6359 961.8812 980.4589 1013.0045 1032.6994 1039.2784 1048.3127 1058.7447 1084.4859 1107.2533 1138.3560 1166.4927 1170.4028 1174.6866 1191.0402 1211.2947 1215.7449 1245.5323 1252.1451 1276.8021 1288.4419 1307.7233 1315.2081 1319.1016 1326.2317 1327.1817 1344.8855 1348.9684 1367.1129 1385.8310 1394.2171 1428.9329 1448.5485 1454.4973 1476.4270 1502.1501 1551.2616 1612.2018 1665.2586 2939.5503 2969.0467 2984.5609 3044.5747 3059.7592 3084.2877 3124.2688 3236.4870 3254.6512 3272.6462 3498.5689 3558.0297 3566.9095
redmass: 5.7093 6.3488 6.2412 6.9572 5.9422 3.8948 5.7603 7.6571 3.8621 5.0460 1.9133 1.7811 6.6409 2.2971 5.9574 2.0883 3.0135 3.4938 7.2691 6.4114 3.1467 6.4033 6.7323 3.6101 5.4741 3.8103 4.1218 4.9091 7.4495 2.7554 3.2097 1.8704 2.8826 3.9152 1.5679 2.1406 6.0494 2.9654 4.4398 3.2820 1.3689 7.7449 5.2924 3.8716 2.8578 4.3504 3.2109 2.3046 1.9251 3.0783 2.6093 3.2205 2.0645 3.2751 2.4378 1.7263 1.8181 2.1822 1.2583 1.9794 2.4937 1.5477 1.5380 1.6376 1.3875 2.5613 1.3912 2.5565 2.2334 1.4087 1.4906 1.6563 1.3937 1.2933 2.4645 6.0359 1.0814 1.0906 4.4376 5.9369 9.0272 8.5958 12.1657 1.0698 1.0843 1.0861 1.0806 1.0707 1.0933 1.1029 1.0936 1.0981 1.1062 1.0794 1.0665 1.0666
irintensity: 0.2114 1.3235 1.1631 0.3048 0.2361 4.2734 6.8064 2.6740 25.5979 10.1451 74.0702 85.8583 0.2522 58.8767 6.9173 89.6666 37.9994 41.3023 4.6175 1.6783 15.0548 10.5313 12.2841 33.2198 11.0466 8.4893 14.7898 15.4254 1.9849 3.0894 57.3089 39.5986 65.1402 15.7618 27.2841 19.9316 3.3516 11.9532 23.4014 30.3631 3.4200 9.1481 22.1167 77.6036 55.3157 59.5084 27.9560 3.9768 25.6067 41.1714 39.2641 16.5623 5.5807 10.6477 28.0832 53.8965 75.9573 7.0971 18.0698 89.3113 80.2262 5.7776 3.2125 11.0069 20.3455 5.4370 3.9598 10.7216 85.4752 10.4095 6.7879 16.3460 2.2829 8.7423 12.6043 0.6819 4.5534 30.7235 9.2568 55.4497 25.0536 434.9371 481.5077 54.8921 22.9756 60.0697 7.3241 29.9463 14.7675 6.0799 8.9785 0.1634 3.3015 205.3116 8.4477 7.9909
temp: 298.150 k
press: 1.00000 atm
elementType: 8 8 8 8 7 7 7 7 7 6 6 6 6 6 6 6 6 6 6 6 6 1 1 1 1 1 1 1 1 1 1 1 1 1
symmnumber: 1
zpe: 669015.4 jmol-1
zpe.correction: 0.254815 hartree
zpe.thermalcorrener: 0.272646 hartree
zpe.thermalcorrenthalpy: 0.273590 hartree
zpe.thermalcorrgfe: 0.207005 hartree
zpe.sumelectzpe: -1038.165888 hartree
zpe.sumelectthermal: -1038.148056 hartree
zpe.sumelectthermalent: -1038.147112 hartree
zpe.sumelectthermalfe: -1038.213697 hartree
dipole: 9.6595 1.4829 0.0736
dipole: 9.7729
quadrupole: -110.3230 -149.0883 -113.7321
quadrupole: -15.2021 5.5967 15.6391
quadrupole: 14.0581 -24.7071 10.6490 -15.2021 5.5967 15.6391
hfenergy: -1038.4207022 hartree
pointgroup: C01 [X(C12H13N5O4)]
dipole: 3.8000114 0.5252575 -0.2602192 debye
polarizability: 209.4271147|1.6560112|167.7364179|-42.5301603|34.8082176|141.813474 unknown
InChI: InChI=1S/C12H13N5O4/c18-4-7-6(19)3-8(21-7)17-5-14-9-10(17)15-12-13-1-2-16(12)11(9)20/h1-2,5-8,15,18-19H,3-4H2
charge 0 multiplicity 1
34 atoms
O  2.033492 1.312222 -0.716316
O  3.622021 -1.807642 -0.267775
O  2.984403 2.486911 1.820709
O  -3.530702 -2.057934 0.029799
N  0.659048 -0.506181 -1.470399
N  -0.673209 1.061615 -0.069179
N  -0.797592 -2.276472 -1.503143
N  -2.79583 0.111454 0.604388
N  -2.308104 2.230778 1.337941
C  1.76353 0.413403 -1.842781
C  3.10805 -0.293864 -2.092919
C  3.758022 -0.409144 -0.690816
C  2.942511 0.574325 0.212483
C  3.781997 1.602724 0.973111
C  -0.456228 -0.128025 -0.725906
C  0.385992 -1.828143 -1.922134
C  -1.352861 -1.224112 -0.745442
C  -2.632936 -1.184516 -0.055702
C  -1.876575 1.186244 0.619307
C  -3.892258 0.535612 1.381385
C  -3.574632 1.820178 1.815403
H  1.436122 1.063842 -2.672168
H  3.713134 0.347945 -2.753078
H  3.028496 -1.290856 -2.551028
H  4.828345 -0.120327 -0.725648
H  2.316908 -0.028419 0.905646
H  4.559087 1.065894 1.563179
H  4.281795 2.279523 0.26052
H  1.093261 -2.393572 -2.521302
H  4.094144 -1.956274 0.590133
H  0.050608 1.785263 -0.009102
H  2.539332 1.96259 2.534415
H  -4.751236 -0.110162 1.531594
H  -4.169734 2.48392 2.437625
