program: Gaussian 09
title: 000130648
version: EM64L-G09RevD.01
frameworkgroup: C1[X(C23H28O)]
method: RPBEPBE
basis: SDD
operation: Freq
keyword: #pfreq=noraman
keyword: PBEPBE/SDD
title: #p freq=noraman PBEPBE/SDD
converged: YES YES NO NO
title: Mulliken charges:
elementType: O C C C C C C C C C C C C C C C C C C C C C C C H H H H H H H H H H H H H H H H H H H H H H H H H H H H
charge: -0.432469 0.167848 0.187842 -0.491937 -0.491659 0.315458 0.330871 -0.747696 -0.744872 -0.745571 -0.745906 -0.605943 -0.423956 0.385078 -0.488379 0.221817 -0.843724 -0.424775 0.447812 -0.358350 -0.386722 -0.411146 -0.367909 0.279927 0.207248 0.200706 0.207936 0.200016 0.211586 0.225407 0.225498 0.211692 0.222560 0.212760 0.208873 0.223848 0.212485 0.226485 0.222182 0.211944 0.248569 0.223934 0.223493 0.236021 0.231686 0.246733 0.228071 0.249541 0.234433 0.217330 0.250044 0.353283
chargesum: 0.00000
title: Mulliken charges with hydrogens summed into heavy atoms:
elementType: O C C C C C C C C C C C C C C C C C C C C C C C
charge: -0.079186 0.167848 0.187842 -0.083983 -0.083707 0.315458 0.330871 -0.085205 -0.097861 -0.100365 -0.085295 -0.357374 -0.200022 0.385078 -0.264886 0.221817 -0.129285 -0.196704 0.447812 -0.108810 -0.152289 -0.193816 -0.117865 0.279927
polarizability: 4.46378934e+02 2.49863838e+01 2.28752696e+02 5.35916800e+00 -1.55111232e+01 1.78208002e+02
1716.lowfreq: -4.0542 0.0004 0.0005 0.0007 2.1974 9.2511 22.7593 29.2712 40.5400
frequency: 22.4706 29.2308 40.5341 50.3673 61.6646 83.9056 113.3159 123.6399 159.7889 184.1856 197.1462 205.7288 214.1328 216.1535 232.7700 251.7572 259.4314 265.4773 289.1684 301.0251 311.8953 331.8008 338.6858 346.7692 358.7683 362.8395 380.3485 390.2437 410.3457 417.7371 442.0770 458.0067 471.1195 488.7707 507.1654 524.0403 535.7543 538.0930 565.9915 602.1669 632.6400 641.0628 671.0843 696.0634 720.6030 765.3122 771.3018 776.4317 805.5289 821.6645 825.9606 828.8837 839.7121 866.4803 883.5652 887.0518 916.8364 927.0014 929.3696 934.4323 937.2643 955.4525 959.5073 962.2807 968.0618 990.0048 1002.5532 1002.8606 1022.6222 1032.6746 1055.6954 1061.8107 1080.1636 1082.8268 1103.7865 1114.0302 1143.9804 1163.1080 1183.0552 1183.8566 1191.4808 1196.2188 1217.7755 1221.1735 1240.0936 1249.7669 1261.5424 1268.3781 1293.2603 1303.4920 1316.5232 1340.5844 1343.8604 1346.8824 1364.9967 1373.8845 1376.0273 1388.8352 1391.0371 1393.8171 1396.3395 1407.4867 1425.7404 1454.1539 1460.1030 1463.7948 1467.3148 1469.9031 1471.7030 1476.3901 1478.0241 1482.0668 1483.9474 1487.3247 1491.0125 1495.9529 1504.1501 1555.3385 1583.7162 1604.6845 1620.6176 1627.7187 2969.4713 2969.6534 2970.4810 2971.2403 2972.9665 2975.0888 2980.1727 3022.2655 3033.3046 3055.4479 3062.9674 3063.2714 3067.9401 3069.1687 3075.2063 3076.2697 3079.5019 3080.5653 3083.8989 3093.0613 3111.2025 3121.4707 3126.9095 3132.5796 3147.0686 3168.9428 3175.0850 3581.8232
redmass: 4.0821 3.7883 4.5370 2.7686 3.1160 4.0954 4.0933 3.4314 3.1333 2.5225 1.4142 1.5958 1.7173 1.5034 1.6536 1.0980 1.1933 2.7300 2.5110 2.7532 3.8654 2.5626 3.0754 2.8531 1.1229 2.7597 2.4584 3.6042 3.2834 2.9785 3.3731 2.9604 3.4778 3.7032 3.0510 2.5215 3.0429 2.8861 3.7615 2.8168 6.1160 3.6989 4.9746 4.5602 3.7228 2.7498 3.5407 4.3139 1.4029 1.8552 2.4378 1.8538 1.9434 3.1940 1.5788 1.8772 1.5763 1.5221 1.5217 1.7273 1.3624 1.5853 1.5728 1.3780 1.4902 2.2051 1.6276 1.7363 1.4551 1.4946 2.3404 2.0491 2.2237 1.6518 1.5258 1.8271 1.3394 1.6816 3.1887 1.1125 1.7569 2.1649 2.2952 2.5360 1.9063 2.4076 2.3631 1.9807 1.8595 2.1606 1.7404 1.8266 1.4417 1.5216 4.0310 1.1961 1.1887 2.5684 1.5306 1.2495 1.2446 2.1582 3.2611 1.0664 1.0602 1.0548 1.0805 1.1225 1.0793 1.1500 1.1466 1.0564 1.0679 1.0845 1.1045 1.6385 2.6922 6.5273 6.1425 6.0233 6.4969 6.5663 1.0428 1.0373 1.0438 1.0448 1.0405 1.0404 1.0556 1.0995 1.1024 1.0892 1.0992 1.0993 1.0986 1.0983 1.1000 1.0998 1.0991 1.0990 1.0879 1.0989 1.0900 1.0857 1.0895 1.0892 1.0953 1.0947 1.0934 1.0660
irintensity: 0.0653 0.8091 0.5022 0.0199 0.4374 0.2929 0.3707 0.3437 0.1095 0.1415 0.4290 0.0476 0.3808 0.1995 0.0308 0.0987 0.1006 0.0757 0.0694 0.6902 3.6386 0.3404 0.3052 1.6943 139.0860 3.5536 1.0794 7.8075 0.4136 0.9371 9.2783 0.4592 1.1985 7.4788 1.1536 28.6654 8.4306 9.6669 4.5162 1.8031 0.9900 2.1595 2.0299 1.6805 1.5487 10.3823 0.7550 10.8313 26.0646 7.9266 22.5624 14.9889 28.4096 9.1559 26.5943 9.4180 5.9586 2.0194 0.0224 3.0939 1.9011 0.6354 1.1025 0.5561 0.4179 14.5802 0.1515 0.8507 4.8209 2.4171 16.2224 7.9384 9.7691 4.3178 79.5047 44.1138 267.9105 1.5917 0.8806 9.3757 6.1458 5.3625 8.7209 0.9072 3.9903 41.4707 13.2604 15.9452 18.2968 8.9224 5.3729 5.9839 3.9563 1.9624 3.7655 6.2568 33.2792 29.9969 12.2703 2.7622 29.9642 20.0485 7.9646 0.0289 0.5292 1.1256 1.4397 9.5946 5.1881 12.7236 7.4911 28.8528 17.6062 9.7312 14.0949 19.4658 152.3480 7.6477 13.2873 12.2104 29.6274 34.7849 26.7933 10.1207 3.1880 54.9041 1.4376 86.9762 71.9431 45.2680 49.0234 19.3279 3.9112 6.6603 46.9654 141.2438 8.1625 34.3887 67.4221 21.3599 23.2450 26.1895 28.3908 18.3270 12.0766 15.6666 25.1242 15.7684 4.2010 67.5234
temp: 298.150 k
press: 1.00000 atm
elementType: 8 6 6 6 6 6 6 6 6 6 6 6 6 6 6 6 6 6 6 6 6 6 6 6 1 1 1 1 1 1 1 1 1 1 1 1 1 1 1 1 1 1 1 1 1 1 1 1 1 1 1 1
symmnumber: 1
zpe: 1163100.6 jmol-1
zpe.correction: 0.443002 hartree
zpe.thermalcorrener: 0.466685 hartree
zpe.thermalcorrenthalpy: 0.467630 hartree
zpe.thermalcorrgfe: 0.390391 hartree
zpe.sumelectzpe: -966.706144 hartree
zpe.sumelectthermal: -966.682460 hartree
zpe.sumelectthermalent: -966.681516 hartree
zpe.sumelectthermalfe: -966.758754 hartree
dipole: -0.6479 -0.7438 1.4633
dipole: 1.7647
quadrupole: -131.4083 -140.7424 -144.9038
quadrupole: -8.9533 13.2720 -3.2840
quadrupole: 7.6099 -1.7242 -5.8856 -8.9533 13.2720 -3.2840
hfenergy: -967.1491458 hartree
pointgroup: C01 [X(C23H28O1)]
dipole: 0.2506968 0.1175291 0.6367017 debye
polarizability: 444.7851211|31.7686248|217.2589872|1.8816828|27.1338275|191.2955239 unknown
InChI: InChI=1S/C23H28O/c1-16(14-17-6-9-19(24)10-7-17)18-8-11-20-21(15-18)23(4,5)13-12-22(20,2)3/h6-11,14-15,24H,12-13H2,1-5H3
charge 0 multiplicity 1
52 atoms
O  -7.677817 -0.85298 -0.410439
C  2.904715 -1.824046 -0.146032
C  4.639208 0.766274 -0.116743
C  4.363839 -1.728965 -0.675342
C  5.197373 -0.673171 0.067314
C  2.303847 -0.409344 0.03244
C  3.105504 0.774079 0.068245
C  2.883679 -2.562138 1.227659
C  2.08688 -2.662197 -1.170547
C  5.34194 1.682865 0.925665
C  4.976817 1.290846 -1.546554
C  0.902753 -0.289903 0.216105
C  2.443403 2.017979 0.252058
C  0.238338 0.951153 0.39959
C  1.051977 2.117596 0.419848
C  -1.247805 1.0081 0.555624
C  -1.816417 2.047246 1.509901
C  -2.031752 0.136798 -0.171188
C  -3.490758 -0.072623 -0.155916
C  -4.339512 0.179167 0.962573
C  -4.105625 -0.617976 -1.325953
C  -5.726088 -0.070862 0.905506
C  -5.48635 -0.865487 -1.400688
C  -6.303156 -0.584219 -0.280704
H  4.341144 -1.491095 -1.757625
H  4.839111 -2.725602 -0.58234
H  5.225092 -0.91426 1.148776
H  6.246751 -0.694622 -0.287351
H  3.273644 -3.592105 1.115692
H  3.498328 -2.038344 1.981316
H  1.854293 -2.624781 1.624529
H  1.071362 -2.899908 -0.806954
H  1.989955 -2.127364 -2.133108
H  2.602589 -3.622933 -1.360183
H  5.118886 2.75267 0.765209
H  5.0368 1.419716 1.954911
H  6.439212 1.560085 0.848818
H  4.546439 0.641837 -2.329923
H  4.570513 2.30733 -1.698532
H  6.073337 1.332355 -1.69261
H  0.295346 -1.201186 0.244993
H  3.034553 2.940811 0.263796
H  0.599525 3.108545 0.534607
H  -1.182431 2.949102 1.542771
H  -1.856953 1.659338 2.547683
H  -2.835175 2.356213 1.221417
H  -1.506742 -0.474809 -0.919978
H  -3.911594 0.534616 1.903264
H  -3.477947 -0.840123 -2.197538
H  -6.352073 0.12211 1.787064
H  -5.94696 -1.274643 -2.304632
H  -8.160499 -0.626144 0.422906
