program: Gaussian 09
title: 000130559
version: EM64L-G09RevD.01
frameworkgroup: C1[X(C9H11N3O2S)]
method: RPBEPBE
basis: SDD
operation: Freq
keyword: #p
keyword: freq=noraman
keyword: PBEPBE/SDD
title: #p freq=noraman PBEPBE/SDD
converged: NO YES NO NO
title: Mulliken charges:
elementType: S O O N N N C C C C C C C C C H H H H H H H H H H H
charge: 0.980656 -0.536673 -0.537259 -0.233359 0.017573 -0.030906 -0.116026 -0.226414 -0.225162 -0.618770 -0.619176 0.499869 -0.381576 -0.400092 -0.368144 0.285651 0.284626 0.277760 0.249628 0.208264 0.276232 0.209040 0.249431 0.237512 0.243240 0.274075
chargesum: 0.00000
title: Mulliken charges with hydrogens summed into heavy atoms:
elementType: S O O N N N C C C C C C C C C
charge: 0.980656 -0.536673 -0.537259 -0.233359 0.017573 -0.030906 -0.116026 0.059237 0.059464 0.116882 0.115526 0.499869 -0.144064 -0.156852 -0.094069
polarizability: 2.58066868e+02 -1.81397973e+01 1.46988128e+02 -3.89659446e-01 5.94966797e+00 1.02680243e+02
1716.lowfreq: -4.9191 -0.0019 0.0004 0.0012 8.0068 9.3512 33.1552 48.1122 56.9519
frequency: 32.9954 48.0541 56.7245 77.8519 90.1777 133.0710 145.7563 205.3445 214.9462 219.8099 225.7684 247.5205 279.4195 286.7890 308.6836 347.9484 388.3081 407.1551 410.2439 416.2888 462.1657 478.6942 502.2803 520.0757 619.1690 624.0067 662.3694 729.6726 804.3625 821.0721 838.1494 847.7183 857.1337 951.9124 966.2665 977.3227 987.7746 1015.4278 1049.3127 1080.9287 1109.8318 1111.0284 1142.1155 1172.5274 1189.9639 1207.7309 1230.7293 1300.6383 1359.7804 1399.9223 1404.8526 1416.4546 1419.7059 1454.4312 1463.7912 1469.2863 1477.0584 1481.9906 1573.2392 1592.3527 2029.3509 2914.8394 2917.7443 3039.7330 3041.5185 3096.7924 3098.5444 3135.3640 3136.7545 3159.0109 3161.8143 3170.4798
redmass: 4.8238 3.8090 3.2420 4.7916 10.4496 4.1037 7.9745 4.8365 2.1363 2.5986 1.2735 2.0976 5.9244 3.2700 5.6370 4.8297 3.1787 5.9164 2.9057 10.5851 3.6877 6.7065 5.1909 4.5095 7.0357 1.6347 6.9231 2.9290 12.3002 4.8998 1.2647 1.6957 4.3203 15.4002 1.3632 1.3782 5.2690 1.4339 2.5983 1.2280 1.4363 1.7716 2.3742 5.1286 1.1332 1.6678 1.4418 1.3038 4.0824 3.6964 1.1520 1.1470 2.5664 1.0474 1.0506 1.0530 1.1064 2.4179 7.3174 5.8508 13.2825 1.0471 1.0465 1.0866 1.0851 1.0984 1.0995 1.0887 1.0888 1.0955 1.0969 1.0882
irintensity: 2.3978 1.6827 0.2875 0.9985 2.0105 0.8143 0.3837 0.6481 4.6725 3.0490 2.5703 5.1755 0.8704 1.6237 9.2337 0.1571 3.5933 0.9088 0.4422 88.3252 10.8540 0.1462 39.1407 146.1278 0.2076 15.4705 38.1417 2.1108 94.7457 17.4657 0.4157 58.5351 47.9810 72.4812 1.7470 0.2770 2.0928 0.6597 43.3459 0.0374 17.1191 12.6915 5.1961 12.1331 29.6563 14.0837 4.9880 2.2703 23.9629 17.7948 28.7148 2.2109 8.9704 24.4044 2.5873 22.2986 70.0639 28.2380 2.8692 115.2885 624.2790 24.0367 92.2728 3.9854 44.3318 1.9411 2.5367 6.7046 6.0918 1.1805 9.8872 4.2094
temp: 298.150 k
press: 1.00000 atm
elementType: 16 8 8 7 7 7 6 6 6 6 6 6 6 6 6 1 1 1 1 1 1 1 1 1 1 1
symmnumber: 1
zpe: 497754.5 jmol-1
zpe.correction: 0.189585 hartree
zpe.thermalcorrener: 0.205586 hartree
zpe.thermalcorrenthalpy: 0.206530 hartree
zpe.thermalcorrgfe: 0.145423 hartree
zpe.sumelectzpe: -1060.971379 hartree
zpe.sumelectthermal: -1060.955378 hartree
zpe.sumelectthermalent: -1060.954433 hartree
zpe.sumelectthermalfe: -1061.015541 hartree
dipole: 4.6138 0.9095 5.3853
dipole: 7.1495
quadrupole: -105.8967 -91.9864 -100.5370
quadrupole: 10.6772 -13.1846 1.3900
quadrupole: -6.4234 7.4869 -1.0636 10.6772 -13.1846 1.3900
hfenergy: -1061.1609633 hartree
pointgroup: C01 [X(C9H11N3O2S1)]
dipole: -1.8186333 0.2992317 -2.1248824 debye
dipolederiv: 2.1172824 -0.0623408 0.0841012 -0.2022681 1.0531035 0.1252987 -0.0037107 0.1467807 1.5105504 -0.7605196 -0.0450059 -0.0411791 -0.0788824 -0.6202966 -0.1404252 0.0053019 -0.0396978 -0.5287839 -0.7096038 0.0356423 -0.0072406 0.1329051 -0.5469939 0.1493093 -0.0320898 0.039552 -0.633114 -0.5703146 -0.0664916 -0.2584313 -0.0073646 -0.4193118 0.0447 -0.1179871 0.0243619 -0.4212955 1.3334674 0.5845567 -0.0664697 1.7324234 0.5728816 0.0159303 -0.3373371 -0.0546702 0.1072771 -1.1117857 -0.2560274 -0.010689 -1.1427045 -0.3783943 -0.0077035 0.1895696 0.0489844 -0.08486 -0.4786127 -0.0405862 -0.0301527 0.112642 -0.1940721 -0.0323353 0.0250315 -0.056955 -0.3429696 0.0624726 0.1062466 0.0308531 -0.2739826 0.0286402 -0.0473451 0.0977822 0.0072433 -0.0539349 0.0633854 -0.0197985 0.0628506 0.2457713 -0.0089346 -0.0120755 -0.0590294 -0.0402322 -0.0477544 0.1268636 0.1260774 0.2659916 -0.09457 0.1933797 0.1945869 0.1432151 -0.006489 -0.0368564 0.1560727 -0.0067468 0.2098278 0.1445455 0.027964 -0.3147872 0.0646884 -0.0686378 0.1250518 1.3064526 0.0605603 0.0939292 -0.1164215 -0.0292966 0.0294812 0.1917341 0.0476388 0.1198383 -0.494472 -0.0957578 0.0099104 -0.1758489 0.0688154 -0.0850155 0.0001385 -0.0691754 -0.1361693 -0.3666815 0.070198 -0.0250665 0.2882948 -0.0098061 -0.0156007 -0.1188773 -0.0408183 -0.1572754 -1.0103204 -0.2893272 0.0408242 -0.591581 -0.1617088 -0.0932353 0.0817057 -0.0707199 -0.2631901 0.0959638 -0.0855442 0.0074817 -0.0445682 0.0811452 0.023932 0.0109967 0.0051609 0.1304093 0.1271032 0.0503815 -0.0316705 0.024573 0.0480554 0.0193945 -0.0069309 0.0326408 0.1260918 0.131898 -0.0637031 -0.0270154 -0.0357615 0.0754797 0.0517551 -0.037823 0.1395986 0.0425167 0.0110113 0.025605 0.061941 0.0618553 0.0400908 -0.1116568 0.1250005 -0.1207092 -0.0079734 -0.0934031 -0.0962142 -0.1663536 0.0345342 -0.0036645 -0.0130613 -0.1222535 -0.0408557 0.0168333 0.1441275 0.0053846 -0.0582006 -0.0362275 -0.0232816 -0.001536 -0.0776812 -0.0898899 0.1242404 -0.0920815 0.0411273 -0.1875522 -0.0563898 0.0370202 0.0614736 -0.0824531 0.0575229 -0.0281452 0.0090771 0.0390711 0.082175 0.0424007 0.1131264 0.0107684 0.1517047 0.0038171 -0.0814431 0.0051603 0.0821607 -0.0315184 0.0664706 -0.0366373 0.0575526 -0.0441984 0.0650841 0.1395864 -0.0484973 -0.0826014 0.0116354 -0.0576597 0.0170259 0.0383988 -0.0138092 0.034601 0.1514012 0.0459542 -0.0168664 -0.0199815 0.0278143 0.0756703 0.0521958 -0.0326882 0.045864 0.2299686 unknown
polarizability: 259.38119|13.1292346|144.696532|-2.9976574|-8.7510354|103.6575167 unknown
InChI: InChI=1S/C9H11N3O2S/c1-12(2)15(13,14)9-5-3-8(4-6-9)7-11-10/h3-7H,1-2H3
charge 0 multiplicity 1
26 atoms
S  2.45112 -0.024449 0.722334
O  3.071362 1.449501 1.021167
O  2.587924 -1.287157 1.739295
N  3.299338 -0.592585 -0.879321
N  -4.470133 -0.119465 -0.177457
N  -5.284595 -0.969164 -0.038462
C  0.608489 0.214813 0.3872
C  0.159391 1.480471 -0.03288
C  -0.261524 -0.871101 0.598533
C  2.828106 -1.938676 -1.278057
C  3.203942 0.453803 -1.922782
C  -2.134794 0.578606 -0.079181
C  -1.216647 1.656717 -0.267217
C  -1.635892 -0.685876 0.362071
C  -3.551327 0.821386 -0.332452
H  0.867827 2.308664 -0.138745
H  0.131025 -1.823036 0.971195
H  2.821674 -2.590451 -0.388679
H  3.56641 -2.345106 -1.992945
H  1.825054 -1.944655 -1.762196
H  3.470553 1.426194 -1.476688
H  2.204889 0.518858 -2.410896
H  3.957551 0.215327 -2.695138
H  -1.588425 2.636531 -0.587433
H  -2.324088 -1.521552 0.532274
H  -3.920932 1.796999 -0.65684
