program: Gaussian 09
title: 000130558
version: EM64L-G09RevD.01
frameworkgroup: C1[X(C17H21NO5)]
method: RPBEPBE
basis: SDD
operation: Freq
keyword: #p
keyword: freq=noraman
keyword: PBEPBE/SDD
title: #p freq=noraman PBEPBE/SDD
converged: YES YES NO NO
title: Mulliken charges:
elementType: O O O O O N C C C C C C C C C C C C C C C C C H H H H H H H H H H H H H H H H H H H H H
charge: -0.306641 -0.263040 -0.237615 -0.259820 -0.436461 -0.054488 -0.207295 -0.136496 -0.231197 -0.500074 -0.485938 -0.485025 -0.014563 -0.648363 0.194587 0.207416 -0.507031 0.251220 -0.517520 -0.372060 0.312160 -0.182494 -0.345106 0.257650 0.233574 0.287385 0.254198 0.230807 0.232192 0.228459 0.228681 0.237264 0.274966 0.230330 0.231087 0.198457 0.238685 0.246314 0.234072 0.264727 0.270756 0.231497 0.255685 0.359058
chargesum: 0.00000
title: Mulliken charges with hydrogens summed into heavy atoms:
elementType: O O O O O N C C C C C C C C C C C C C C C C C
charge: -0.306641 -0.263040 -0.237615 -0.259820 -0.077403 -0.054488 0.050355 0.097077 0.056188 -0.015069 -0.025287 -0.019080 0.260403 0.011511 0.194587 0.207416 0.212041 0.251220 -0.252794 -0.101304 0.312160 0.049003 -0.089421
polarizability: 2.62757862e+02 9.44085045e+00 1.83663610e+02 -4.01992601e+00 2.56273300e+01 1.67399038e+02
1716.lowfreq: -6.0572 0.0005 0.0008 0.0009 1.2739 8.3444 22.1134 23.3575 31.9213
frequency: 22.0797 23.1909 31.9014 47.3830 63.0084 84.4072 85.3782 103.9670 122.4865 151.2204 162.3471 185.2868 191.3097 205.2679 220.3651 225.2368 231.4167 253.1617 266.1989 313.8052 335.9975 359.0822 377.9819 389.9623 404.1232 421.9866 440.4288 457.4484 488.2221 512.9045 530.4244 536.3535 592.5636 658.4214 666.4381 676.9380 697.2298 716.2141 727.4067 743.8462 765.2117 785.4732 803.2286 809.9560 840.6940 850.5410 857.9304 885.3858 896.4648 914.8676 918.6801 951.9206 965.6518 971.3797 984.9656 986.6038 989.6247 998.2981 1042.3913 1048.4992 1059.8597 1074.7996 1078.3516 1103.3008 1113.3288 1119.8316 1124.6562 1128.0698 1143.3412 1149.0154 1154.8157 1167.8037 1182.2993 1193.4592 1197.7335 1214.4557 1231.4330 1233.0125 1262.7324 1275.5459 1280.2130 1290.3759 1299.2425 1304.6529 1312.3020 1315.2147 1343.5582 1357.8623 1371.7685 1403.5186 1422.3355 1429.8018 1437.8399 1451.9086 1458.9498 1463.9663 1466.7792 1473.2079 1484.6421 1486.1729 1493.6411 1598.1024 1609.8872 1619.7927 1633.9109 2891.0022 3005.1628 3008.5709 3013.3652 3020.7129 3028.2688 3037.4414 3047.1105 3057.1767 3063.4508 3069.2969 3081.0171 3082.6131 3086.9407 3107.1727 3129.2234 3143.8229 3150.4273 3172.2401 3186.8280 3581.5916
redmass: 4.6085 5.1695 5.4621 4.3734 7.1665 4.1647 1.1984 3.7797 4.2950 5.2270 4.4668 2.3309 4.1179 1.3367 2.5421 4.1001 5.1474 6.4500 2.4924 3.7253 4.3844 2.5416 1.1267 5.8375 4.5831 3.3130 3.3348 3.9821 5.1960 3.8786 5.6081 4.9791 3.9897 6.4211 5.7999 2.7567 5.0592 4.1306 3.4894 4.6864 7.3810 2.3981 2.7155 1.5094 2.8504 2.3148 3.9434 3.8381 1.5433 4.0814 1.4160 3.5617 2.6835 2.7799 6.0864 1.3469 2.5325 2.8252 1.9471 2.4398 1.9018 1.7280 2.4105 1.7990 1.2707 1.8424 2.1744 1.7562 1.4601 1.4472 1.5820 1.1431 1.7470 1.6883 1.9381 1.5365 1.2820 1.4104 1.3762 2.4103 1.4632 1.4548 1.5816 1.3285 1.4439 1.4032 1.5128 1.4280 1.5860 8.4860 1.1943 1.1644 3.2053 1.0500 1.0893 1.0505 1.0544 1.0667 1.0564 2.6222 1.0897 8.1400 6.6680 8.3020 9.1281 1.0527 1.0295 1.0599 1.0602 1.0631 1.0768 1.0850 1.0868 1.0886 1.1025 1.0866 1.1034 1.1006 1.1039 1.1044 1.0919 1.0880 1.1049 1.0941 1.0966 1.0660
irintensity: 0.2303 0.4497 1.5068 1.3011 0.6622 0.7802 0.3034 0.0116 1.9178 0.8091 2.0188 2.6381 3.1206 2.1521 5.2091 0.8093 4.1056 6.1382 7.3675 19.9497 2.8422 1.4850 146.8715 4.4078 4.0032 9.4893 0.7839 19.2713 3.1982 3.2998 3.3503 8.7888 6.8160 3.8928 1.1050 8.3818 10.0850 6.6684 48.5999 3.7547 5.8350 6.4615 4.1612 24.5129 7.7197 1.8405 7.1033 73.2009 22.9270 8.4710 1.9335 104.6420 23.4978 17.8106 11.1245 0.9051 28.9985 33.5450 22.2457 101.1418 10.9765 123.5362 146.2526 4.2222 1.4208 54.9568 170.8577 16.6246 128.8387 12.5194 35.5999 59.0301 51.1861 92.4265 98.6116 9.0185 6.1961 36.0933 5.3082 246.2912 22.3245 12.5343 53.2881 2.0143 1.5864 24.7128 5.3339 7.8806 21.3490 23.0923 21.7179 4.9980 124.5489 13.7085 6.6680 9.7708 11.8570 12.3305 1.3489 2.5203 32.3728 121.8407 45.0297 44.9524 148.9326 112.1586 33.8983 16.4894 9.6262 37.7803 47.8013 4.8162 51.2701 15.8504 5.2964 3.4366 20.3468 30.2045 44.6882 25.1552 7.6317 10.1615 15.6136 7.2887 5.0007 41.6512
temp: 298.150 k
press: 1.00000 atm
elementType: 8 8 8 8 8 7 6 6 6 6 6 6 6 6 6 6 6 6 6 6 6 6 6 1 1 1 1 1 1 1 1 1 1 1 1 1 1 1 1 1 1 1 1 1
symmnumber: 1
zpe: 932920.3 jmol-1
zpe.correction: 0.355331 hartree
zpe.thermalcorrener: 0.377279 hartree
zpe.thermalcorrenthalpy: 0.378223 hartree
zpe.thermalcorrgfe: 0.302490 hartree
zpe.sumelectzpe: -1089.551419 hartree
zpe.sumelectthermal: -1089.529471 hartree
zpe.sumelectthermalent: -1089.528527 hartree
zpe.sumelectthermalfe: -1089.604259 hartree
dipole: -2.5636 0.6730 1.1521
dipole: 2.8901
quadrupole: -122.4083 -120.5388 -139.3979
quadrupole: 0.0743 -1.9988 4.2333
quadrupole: 5.0401 6.9095 -11.9496 0.0743 -1.9988 4.2333
hfenergy: -1089.9067496 hartree
pointgroup: C01 [X(C17H21N1O5)]
dipole: 0.9816247 -0.2833297 0.4989907 debye
polarizability: 262.8995737|8.0476193|181.7235409|6.6137667|-25.8471541|169.1973961 unknown
InChI: InChI=1S/C17H21NO5/c1-18-11-6-7-13(18)15(17(21)22-2)14(9-11)23-16(20)10-4-3-5-12(19)8-10/h3-5,8,11,13-15,19H,6-7,9H2,1-2H3
charge 0 multiplicity 1
44 atoms
O  -0.440668 0.233196 0.212662
O  1.655951 -3.012737 0.412816
O  1.335815 -1.98373 -1.650156
O  -1.20678 1.568662 -1.542873
O  -6.366736 1.096677 -1.083284
N  3.507138 0.957313 1.203187
C  3.34361 -0.223467 0.302162
C  2.935269 2.057511 0.357698
C  1.823474 -0.618701 0.361831
C  3.778939 0.269675 -1.125456
C  3.517133 1.813906 -1.083203
C  1.394349 1.909181 0.395186
C  0.971744 0.543243 -0.182121
C  4.906118 1.187633 1.634625
C  1.563899 -1.895833 -0.420517
C  -1.444706 0.812619 -0.566358
C  1.457945 -4.325575 -0.250763
C  -2.809765 0.429853 -0.097931
C  -3.913691 0.950092 -0.819902
C  -3.018631 -0.414288 1.021509
C  -5.224945 0.620877 -0.417725
C  -4.339555 -0.731623 1.409991
C  -5.445642 -0.220839 0.699288
H  3.944587 -1.072453 0.669551
H  3.222222 3.039258 0.77196
H  1.586343 -0.796819 1.423663
H  3.21141 -0.234272 -1.926624
H  4.848464 0.05206 -1.29227
H  4.454092 2.380406 -1.225761
H  2.811688 2.141415 -1.866974
H  1.06398 1.975818 1.447411
H  0.907984 2.715702 -0.181414
H  1.000544 0.558535 -1.286625
H  5.24705 0.323289 2.231543
H  4.938831 2.079651 2.284678
H  5.632742 1.340492 0.80138
H  2.227169 -4.483291 -1.025503
H  0.460578 -4.366845 -0.719364
H  1.549434 -5.064467 0.557355
H  -3.715111 1.600233 -1.681477
H  -2.157478 -0.807197 1.56699
H  -4.512151 -1.382338 2.273768
H  -6.473934 -0.457901 0.988063
H  -6.115508 1.67068 -1.849118
