program: Gaussian 09
title: 000130538
version: EM64L-G09RevD.01
frameworkgroup: C1[X(C17H12O5)]
method: RPBEPBE
basis: SDD
operation: Freq
keyword: #pfreq=noraman
keyword: PBEPBE/SDD
title: #p freq=noraman PBEPBE/SDD
converged: NO YES NO NO
title: Mulliken charges:
elementType: O O O O O C C C C C C C C C C C C C C C C C H H H H H H H H H H H H
charge: -0.250954 -0.219630 -0.240885 -0.217186 -0.444924 0.187690 0.188845 0.186960 0.186539 0.056297 -0.477763 -0.474022 0.323957 0.320173 -0.358766 -0.356107 -0.339305 -0.352519 0.037924 0.105298 -0.363283 -0.786878 0.321934 0.294194 0.272228 0.271065 0.254758 0.292649 0.227147 0.226802 0.246035 0.246212 0.265562 0.369954
chargesum: 0.00000
title: Mulliken charges with hydrogens summed into heavy atoms:
elementType: O O O O O C C C C C C C C C C C C C C C C C
charge: -0.250954 -0.219630 -0.240885 -0.217186 -0.074970 0.187690 0.188845 0.186960 0.186539 0.056297 -0.155829 -0.179828 0.323957 0.320173 -0.086537 -0.085043 -0.084547 -0.059870 0.037924 0.105298 0.090666 -0.029070
polarizability: 3.90294103e+02 3.30261429e+00 2.07162342e+02 -1.83944919e-02 1.60679569e-02 8.38982464e+01
1716.lowfreq: -7.6351 -0.0005 -0.0004 0.0006 3.1327 3.8431 28.0262 46.3721 53.6607
frequency: 28.0136 46.3636 53.6581 69.1864 79.0696 110.5465 137.7054 145.4853 153.5008 158.0514 163.1802 215.3631 228.8057 287.8898 292.6151 320.7971 323.1333 334.6952 410.1120 418.2698 430.3360 458.0276 465.3811 469.4944 501.7209 502.3285 513.8011 521.4530 582.1755 586.5564 618.4509 625.4547 653.7928 687.8957 706.1321 731.8809 738.3999 767.7355 804.2637 834.7744 852.8083 857.8278 861.5338 945.9496 952.5418 954.5088 962.5932 984.4827 1004.5728 1006.2603 1008.3644 1030.0461 1056.2036 1065.5364 1105.6657 1126.0387 1152.5514 1187.0239 1198.5078 1206.1542 1219.3207 1230.5281 1252.4735 1260.6610 1285.6607 1298.5659 1373.7994 1376.7937 1399.8587 1403.7279 1415.4625 1436.5712 1447.4406 1451.7993 1461.4715 1465.8897 1478.7202 1556.0080 1564.0059 1571.5956 1593.7820 1607.3727 1612.7900 1633.9168 2948.6693 2986.2975 2987.0306 3069.6439 3128.9659 3152.1600 3156.8059 3156.9001 3158.4052 3176.6461 3177.6438 3406.0738
redmass: 8.9005 6.3563 4.5310 6.2084 7.1355 3.3946 5.6738 3.4710 5.3861 1.3855 2.8890 8.0043 5.3468 8.0844 5.1400 6.7929 6.0562 7.3416 3.4945 4.4001 1.3231 3.3361 6.2350 6.7405 2.9178 7.3778 2.8897 7.6631 4.7609 2.9303 2.9506 7.4087 6.8420 6.4291 4.4858 7.0061 3.9037 5.5460 4.5165 1.4648 6.1860 1.4157 7.1190 3.6937 1.4518 2.7625 1.4548 1.4552 1.3738 1.9128 3.3900 1.8225 2.8839 2.0581 3.0649 1.7875 1.4882 1.0755 2.3620 2.5594 1.8722 2.4696 2.0924 1.6611 2.1894 2.2538 1.2885 1.6399 6.0345 6.1148 5.2749 5.2002 1.1099 1.2053 1.0488 2.4417 2.7341 7.6914 8.1918 7.6341 8.3042 8.4994 7.1905 7.6971 1.0570 1.1023 1.0380 1.0965 1.0992 1.0891 1.0898 1.0905 1.0920 1.0971 1.0967 1.0640
irintensity: 0.0385 1.9633 7.6422 0.0342 2.0180 14.0618 2.9432 0.2858 0.0713 0.5972 0.0523 0.4797 5.5354 1.2162 3.7329 7.3024 49.8142 7.3114 3.3935 1.1981 81.2507 0.0046 1.1729 7.9205 16.7866 3.0333 5.5165 8.0012 38.8230 44.6612 0.0977 17.1381 3.1233 0.8403 3.0213 1.6255 0.1691 25.1308 6.1198 51.9397 23.7553 47.4785 16.5114 79.1737 8.1908 17.9352 2.5591 8.1112 0.4734 3.0273 96.1332 0.5512 104.3844 19.4501 26.5439 88.2636 16.7326 5.8321 15.4532 37.0053 101.3697 89.2644 919.5372 29.0353 42.6625 24.9451 84.3307 78.3104 4.0510 25.0536 37.2159 50.2593 40.7772 11.1336 21.9053 109.5762 13.2773 8.5064 70.6763 227.7900 80.8325 262.5154 191.5595 8.6169 62.0026 23.7577 2.6025 9.1561 18.5553 4.9989 3.4323 0.5382 5.3240 2.3758 2.9062 29.7391
temp: 298.150 k
press: 1.00000 atm
elementType: 8 8 8 8 8 6 6 6 6 6 6 6 6 6 6 6 6 6 6 6 6 6 1 1 1 1 1 1 1 1 1 1 1 1
symmnumber: 1
zpe: 649567.0 jmol-1
zpe.correction: 0.247407 hartree
zpe.thermalcorrener: 0.266188 hartree
zpe.thermalcorrenthalpy: 0.267132 hartree
zpe.thermalcorrgfe: 0.199532 hartree
zpe.sumelectzpe: -1029.607293 hartree
zpe.sumelectthermal: -1029.588513 hartree
zpe.sumelectthermalent: -1029.587568 hartree
zpe.sumelectthermalfe: -1029.655169 hartree
dipole: 0.9947 4.1112 0.0053
dipole: 4.2298
quadrupole: -169.7874 -121.2175 -126.8594
quadrupole: -19.6225 -0.0606 0.0052
quadrupole: -30.4993 18.0706 12.4287 -19.6225 -0.0606 0.0052
hfenergy: -1029.8547004 hartree
pointgroup: C01 [X(C17H12O5)]
dipole: -0.409307 1.612576 -0.0380253 debye
polarizability: 390.3054762|-1.1913902|207.0640152|3.5033065|-2.4170502|83.9851999 unknown
InChI: InChI=1S/C17H12O5/c1-9(19)10-2-4-15-12(6-10)17(21)13-7-11(14(20)8-18)3-5-16(13)22-15/h2-7,18H,8H2,1H3
charge 0 multiplicity 1
34 atoms
O  -0.374876 1.983983 -0.019133
O  -0.283818 -2.219488 0.063874
O  4.816921 -1.876871 0.112468
O  -6.443654 -0.072389 -0.049354
O  7.164447 -0.635561 0.121599
C  0.926075 -0.120617 0.036818
C  -1.579631 -0.17688 0.010332
C  0.848184 1.300718 0.007696
C  -1.570041 1.244065 -0.01774
C  -0.310532 -0.950061 0.040511
C  2.207076 -0.718332 0.062279
C  -2.833048 -0.838759 0.00891
C  3.380746 0.067894 0.05929
C  -4.040034 -0.111529 -0.019251
C  2.006953 2.109234 0.004061
C  -2.765491 1.997022 -0.046231
C  3.265163 1.492179 0.029815
C  -3.989849 1.317303 -0.046848
C  4.706993 -0.612932 0.087374
C  -5.392239 -0.776537 -0.021479
C  6.000545 0.215992 0.088642
C  -5.464243 -2.296817 0.003541
H  2.280218 -1.811083 0.084587
H  -2.812841 -1.933353 0.030742
H  1.896605 3.196698 -0.018748
H  -2.708737 3.088756 -0.067104
H  4.161487 2.120683 0.026917
H  -4.940323 1.860399 -0.068404
H  6.00139 0.888437 0.972721
H  6.02475 0.852629 -0.82159
H  -4.972788 -2.703722 0.90698
H  -4.950321 -2.73437 -0.872674
H  -6.519361 -2.608071 -0.004464
H  6.829473 -1.578621 0.133161
