program: Gaussian 09
title: 000130631
version: EM64L-G09RevD.01
frameworkgroup: C1[X(C21H22O4)]
method: RPBEPBE
basis: SDD
operation: Freq
keyword: #pfreq=noraman
keyword: PBEPBE/SDD
title: #p freq=noraman PBEPBE/SDD
converged: YES YES NO NO
title: Mulliken charges:
elementType: O O O O C C C C C C C C C C C C C C C C C C C C C H H H H H H H H H H H H H H H H H H H H H H
charge: -0.212292 -0.276810 -0.439027 -0.241299 -0.038696 0.432029 0.453046 0.182318 -0.777641 -0.708650 0.344058 0.273961 -0.549439 -0.662171 0.428898 -0.181088 -0.335953 -0.055204 -0.390383 -0.614301 -0.067808 -0.031690 -0.718421 -0.701661 -0.502775 0.235050 0.218536 0.265786 0.244821 0.235236 0.230568 0.272140 0.239736 0.229070 0.233547 0.303298 0.258286 0.226831 0.219682 0.214263 0.213603 0.213516 0.250074 0.375234 0.218392 0.232204 0.261127
chargesum: 0.00000
title: Mulliken charges with hydrogens summed into heavy atoms:
elementType: O O O O C C C C C C C C C C C C C C C C C C C C C
charge: -0.212292 -0.276810 -0.063793 -0.241299 -0.038696 0.432029 0.453046 0.182318 -0.058270 0.001975 0.344058 0.273961 -0.277299 -0.422435 0.428898 0.047981 -0.102405 -0.055204 -0.132097 -0.311003 -0.067808 -0.031690 -0.057644 -0.024467 0.208948
chargesum: -0.00426
polarizability: 4.82706951e+02 -7.27058125e+00 2.57397872e+02 5.89538522e+00 1.58555062e+00 1.43230129e+02
1716.lowfreq: -48.5673 -4.5437 -3.7109 -3.2613 3.4951 5.1824 24.1862 28.2524 34.2073
frequency: 15.0080 27.9539 32.1350 40.7647 56.9637 77.8238 95.7219 111.6566 120.8547 149.3957 157.5124 184.1254 198.3238 217.6434 225.1355 229.9548 238.0323 249.1649 256.4774 274.3104 291.4208 296.3160 302.5578 309.5065 326.0619 334.8217 340.1965 354.7035 370.9585 397.7844 410.3537 431.1179 446.7569 464.7577 474.4408 484.9551 505.5437 532.9972 569.9969 580.0931 615.6161 631.4548 648.3210 668.0321 695.8133 727.4981 744.6720 758.6169 776.0006 786.7779 795.7324 829.6661 838.8770 874.1766 895.7095 911.3329 919.7991 923.7038 935.9684 949.1905 951.2501 956.5170 965.3582 987.5964 1005.4565 1029.5690 1044.7965 1076.9477 1101.9146 1107.8456 1116.8074 1120.3570 1149.5753 1151.0482 1159.3408 1182.6564 1203.7148 1218.2011 1229.3258 1241.0396 1261.3210 1270.7555 1286.4864 1304.9299 1322.8496 1340.0957 1370.1153 1373.0766 1377.9247 1394.5053 1397.7969 1405.1969 1405.4726 1428.4129 1446.5826 1453.5026 1462.8943 1465.3504 1468.1507 1469.2242 1473.5472 1480.7103 1483.3096 1485.8815 1490.5710 1490.9256 1502.3838 1543.0864 1564.6343 1571.5372 1596.7882 1612.9759 1622.6693 2978.0233 2980.6617 2983.6694 2990.1185 2995.6981 2998.6366 3061.6271 3070.1940 3077.1233 3081.2477 3088.1747 3091.9490 3092.5337 3094.8063 3101.8733 3106.0168 3106.8188 3136.8240 3150.4990 3160.9642 3166.8446 3567.5875
redmass: 5.7203 2.6095 2.7169 3.0263 6.1047 2.7697 4.3281 3.8382 3.9193 2.0516 3.9400 4.1120 3.5649 2.2737 1.4206 1.5445 2.7297 1.8141 1.1702 2.6559 3.1955 2.3580 1.5076 4.1564 2.1424 2.0089 3.4295 5.1722 3.3336 4.8903 2.9660 4.2437 4.1206 4.4134 5.8793 5.2846 4.8181 4.6667 5.1720 4.9246 5.1308 4.0008 5.4292 3.0588 5.6178 4.9905 3.7136 4.4261 5.7831 4.5799 5.5179 2.0762 2.3128 2.8461 2.5356 1.5534 1.3067 1.6458 4.9024 1.5392 1.5510 1.9344 2.1654 1.3500 1.3187 2.8066 2.9887 1.8709 2.1452 1.2439 2.4633 2.5177 1.7466 1.6237 2.0019 1.9966 1.8652 3.0334 2.8969 1.8384 1.9270 2.8481 1.3405 2.7823 1.5923 2.0682 1.2857 2.1729 1.3976 1.3146 1.2485 2.1653 4.5254 1.3305 1.9249 1.0990 1.0852 1.2467 1.0519 1.0520 1.1241 1.5969 1.1573 1.0852 1.0887 1.0856 4.2421 8.0283 6.6550 7.4883 7.0865 6.9534 7.1404 1.0352 1.0360 1.0329 1.0331 1.0363 1.0826 1.0863 1.1002 1.0991 1.1002 1.1014 1.1014 1.1003 1.0999 1.0990 1.0887 1.0983 1.1057 1.0865 1.0958 1.0902 1.0656
irintensity: 0.4942 2.1810 1.9891 0.9739 7.1976 0.0606 0.8769 0.5186 2.2428 5.0140 3.1485 2.6927 2.0010 1.1338 1.8149 0.9694 1.7533 1.5590 2.5151 8.9760 29.4877 9.6447 5.8769 16.8824 34.5597 16.1815 14.1426 3.4845 8.2969 7.6340 6.7325 9.1944 1.3663 4.5357 0.6546 20.6618 4.4563 0.0986 6.2844 4.4731 17.8992 6.0999 1.3975 10.8478 3.7831 1.1809 10.8850 0.3853 1.6022 1.0797 2.7197 7.2326 13.9501 4.2181 5.4827 20.3670 4.6805 34.3740 37.7216 16.5955 7.8308 19.2737 42.9305 3.5697 1.8435 5.4982 23.7310 14.3414 56.6044 7.6820 13.5374 3.8861 66.5606 18.0546 12.6546 32.0604 338.5648 46.4543 26.4258 1.3739 64.5988 46.9648 4.7034 152.1380 12.4724 14.3218 6.1440 23.3687 10.8208 25.9540 19.7424 51.3484 104.9440 2.1150 9.8012 24.9000 9.3658 68.6113 4.9427 5.8545 57.2682 18.3985 30.5757 33.6619 14.7063 28.4364 157.7470 79.5270 192.6499 97.8465 151.2581 132.6450 32.4934 32.5179 42.0349 22.0258 79.1315 15.8512 7.7580 8.4010 1.2336 89.6330 38.9313 13.1497 11.9477 27.2721 22.9761 35.7205 11.8887 10.4760 14.0082 0.5398 8.2595 3.6711 25.8883
temp: 298.150 k
press: 1.00000 atm
elementType: 8 8 8 8 6 6 6 6 6 6 6 6 6 6 6 6 6 6 6 6 6 6 6 6 6 1 1 1 1 1 1 1 1 1 1 1 1 1 1 1 1 1 1 1 1 1 1
symmnumber: 1
zpe: 985819.4 jmol-1
zpe.correction: 0.375479 hartree
zpe.thermalcorrener: 0.400126 hartree
zpe.thermalcorrenthalpy: 0.401070 hartree
zpe.thermalcorrgfe: 0.320550 hartree
zpe.sumelectzpe: -1112.475244 hartree
zpe.sumelectthermal: -1112.450597 hartree
zpe.sumelectthermalent: -1112.449653 hartree
zpe.sumelectthermalfe: -1112.530173 hartree
dipole: 3.6931 5.2634 1.5350
dipole: 6.6105
quadrupole: -163.5777 -142.8558 -148.3329
quadrupole: 0.3999 -9.0779 -6.4727
quadrupole: -11.9889 8.7330 3.2559 0.3999 -9.0779 -6.4727
hfenergy: -1112.8507228 hartree
pointgroup: C01 [X(C21H22O4)]
dipole: -1.4736525 2.0601863 -0.5898462 debye
polarizability: 482.6678971|8.9112664|257.5177665|2.7803057|-1.5963967|143.1492872 unknown
InChI: InChI=1S/C21H22O4/c1-11(2)13-9-14-15(19(24)20(13)25-5)8-12-6-7-18(23)21(3,4)16(12)10-17(14)22/h6-11,24H,1-5H3
charge 0 multiplicity 1
47 atoms
O  6.036082 0.231059 0.248138
O  -4.355992 1.550991 -0.331037
O  -1.779248 2.750575 -0.432377
O  -0.076879 -3.050568 0.728441
C  3.841664 -0.547412 -0.568326
C  2.374693 -0.443885 -0.087174
C  1.870067 0.902353 0.235069
C  4.791778 0.457212 0.152056
C  4.449586 -1.966354 -0.484635
C  3.856506 -0.087579 -2.077691
C  -0.704838 0.572032 0.080766
C  -0.884075 -0.848045 0.219583
C  1.620225 -1.593782 0.000629
C  0.533312 1.299876 0.27199
C  -3.352205 -0.59294 0.065751
C  -4.757365 -1.189585 0.020747
C  2.850821 1.929329 0.59555
C  0.21414 -1.85383 0.371596
C  4.207486 1.725882 0.608436
C  -2.196198 -1.381578 0.211523
C  -1.883319 1.368686 -0.149882
C  -3.186209 0.81832 -0.110206
C  -4.877856 -2.551986 0.73866
C  -5.232131 -1.300942 -1.459091
C  -4.511306 2.898747 0.261083
H  4.338071 -2.399799 0.52495
H  3.988316 -2.650216 -1.218161
H  5.52812 -1.899704 -0.701163
H  4.890963 -0.125083 -2.462395
H  3.227531 -0.771802 -2.673961
H  3.472167 0.940153 -2.201999
H  2.135808 -2.546071 -0.163462
H  0.393114 2.35775 0.545935
H  -5.432218 -0.465505 0.517213
H  2.451741 2.902474 0.912254
H  -2.2765 -2.462598 0.352367
H  4.904595 2.496556 0.953708
H  -4.507451 -2.502881 1.778574
H  -5.93756 -2.86494 0.765383
H  -4.315027 -3.344785 0.212267
H  -4.580109 -1.991907 -2.025196
H  -6.265134 -1.692884 -1.497635
H  -5.216347 -0.314913 -1.953712
H  -0.916259 2.945112 -0.876046
H  -4.260843 2.877352 1.337969
H  -5.577663 3.135239 0.125898
H  -3.874654 3.633177 -0.253487
