program: Gaussian 09
title: 000130494
version: EM64L-G09RevD.01
frameworkgroup: C1[X(C9H13NO3)]
method: RPBEPBE
basis: SDD
operation: Freq
keyword: #p
keyword: freq=noraman
keyword: PBEPBE/SDD
title: #p freq=noraman PBEPBE/SDD
converged: YES YES NO NO
title: Mulliken charges:
elementType: O O O N C C C C C C C C C H H H H H H H H H H H H H
charge: -0.262398 -0.235468 -0.289570 -0.176866 -0.172806 -0.474198 -0.476291 -0.377395 0.265099 0.234900 -0.168462 -0.503291 -0.521571 0.305554 0.236884 0.243503 0.252479 0.231939 0.245674 0.226075 0.225367 0.234246 0.251332 0.235866 0.218378 0.251019
chargesum: 0.00000
title: Mulliken charges with hydrogens summed into heavy atoms:
elementType: O O O N C C C C C C C C C
charge: -0.262398 -0.235468 -0.289570 -0.176866 0.132748 0.006189 0.008128 0.094355 0.265099 0.234900 0.056905 0.218153 -0.052174
polarizability: 1.36997121e+02 9.60813532e+00 1.20117642e+02 -8.86692830e+00 3.44980843e+00 8.06710372e+01
1716.lowfreq: -10.6040 -0.0004 0.0003 0.0006 6.8065 13.4661 35.1809 52.5112 68.7486
frequency: 35.1020 52.4892 68.7234 99.2534 106.4140 118.4261 141.1432 167.7236 201.4387 233.2535 269.1263 301.1841 332.4064 353.0895 392.3857 509.6610 528.9934 582.9316 653.6274 678.9963 719.2981 781.9521 789.8922 841.1636 868.7150 899.3321 915.6085 933.3837 980.8408 985.3245 996.1672 999.7008 1057.2296 1061.5715 1097.8270 1114.5380 1134.6796 1148.3708 1151.0728 1170.9258 1189.3077 1234.3767 1262.3715 1290.6548 1304.1313 1328.1645 1329.4110 1340.4036 1368.5129 1416.1271 1421.6597 1452.9159 1463.8202 1469.9702 1474.2002 1490.9208 1555.7677 1645.5428 1646.1432 2973.0108 3005.5575 3018.4991 3026.5532 3050.8862 3072.0825 3087.1519 3098.3036 3101.0281 3108.9808 3133.6676 3151.7895 3216.3659
redmass: 4.4138 5.6217 5.1419 1.3052 1.8213 3.7623 2.6629 3.1857 2.7093 4.1195 2.6369 3.3208 6.0735 4.8556 5.0938 2.0163 4.1332 2.2135 4.2061 4.2098 3.8975 3.5238 3.3906 4.4197 1.9706 1.9357 2.6274 3.0001 2.8780 1.4408 1.6772 1.3137 1.6045 1.8062 1.9121 1.2677 3.4891 1.4778 1.4733 1.6858 2.4026 1.2469 1.6418 1.4852 1.3216 1.4340 1.4282 1.4311 2.2034 1.5871 1.1892 1.0498 1.0507 1.0868 1.0934 1.0959 10.6091 5.9738 6.3073 1.0637 1.0295 1.0630 1.0637 1.0980 1.0862 1.1022 1.0587 1.1057 1.1045 1.0944 1.1050 1.1160
irintensity: 3.2960 0.9278 8.7115 0.4080 0.1041 0.1217 1.6698 0.2824 4.8856 8.3356 1.8861 10.9941 10.6650 6.9874 10.3660 2.0911 3.5700 2.1136 12.9389 2.9998 4.3758 26.8739 10.8648 4.4689 4.6412 0.6595 11.2591 14.4557 4.3194 8.3453 28.7529 42.8024 14.2455 13.2451 13.0991 0.4177 296.2673 30.7279 6.8647 12.6520 5.3236 6.8770 15.4028 30.2095 6.7369 17.7204 16.6922 25.6276 77.3424 199.3986 18.7458 14.4561 11.8147 11.6060 14.1254 3.0722 171.2714 73.5225 85.9460 49.5788 33.4012 24.1887 23.7287 21.9840 4.6780 17.5724 6.4205 38.8162 23.3384 16.5329 16.2498 8.3442
temp: 298.150 k
press: 1.00000 atm
elementType: 8 8 8 7 6 6 6 6 6 6 6 6 6 1 1 1 1 1 1 1 1 1 1 1 1 1
symmnumber: 1
zpe: 551491.9 jmol-1
zpe.correction: 0.210052 hartree
zpe.thermalcorrener: 0.223705 hartree
zpe.thermalcorrenthalpy: 0.224649 hartree
zpe.thermalcorrgfe: 0.168589 hartree
zpe.sumelectzpe: -630.165218 hartree
zpe.sumelectthermal: -630.151565 hartree
zpe.sumelectthermalent: -630.150621 hartree
zpe.sumelectthermalfe: -630.206681 hartree
dipole: 0.4842 3.6839 0.0628
dipole: 3.7161
quadrupole: -60.8127 -72.3042 -82.3301
quadrupole: -5.4187 -3.0128 -2.6363
quadrupole: 11.0030 -0.4886 -10.5144 -5.4187 -3.0128 -2.6363
hfenergy: -630.3752697 hartree
pointgroup: C01[X(C9H13N1O3)]
dipole: -0.2896075 -1.4316158 0.0640857 debye
dipolederiv: -1.1159784 0.5334219 -0.170002 0.593732 -0.6408306 0.0693374 -0.2029409 0.1318755 -0.5267185 -0.5593141 0.1780829 0.0222899 0.1727487 -0.4105248 -0.1021408 -0.1852076 0.0932253 -0.8553289 -0.6934341 0.0783514 -0.0879409 -0.1158539 -0.94331 0.1932919 -0.0051692 0.2307386 -0.4611195 -0.9051273 -0.4826417 0.0827105 -0.3804347 -0.9658083 0.0792067 -0.0444112 -0.0225656 -0.2871951 0.4968103 0.0502509 0.0055516 0.099887 -0.0236305 -0.0571773 0.094135 0.0417722 0.1281252 0.0277791 0.017719 -0.0102585 -0.0138349 0.1133827 0.0684573 0.0260988 0.0027356 0.0888669 0.0410852 0.008778 -0.045089 -0.0300453 0.0678961 0.0438673 -0.053581 0.0025486 0.0398808 0.1231732 -0.1321122 -0.0155818 -0.0773565 0.5306065 -0.0429604 -0.0810822 -0.0719591 0.2780312 1.123838 -0.7043558 0.1600005 -0.6616605 0.6323988 0.0139605 0.3736564 -0.2082693 1.0406984 1.2807337 0.4950043 0.0953454 0.4485195 1.2283547 -0.2405768 0.123809 -0.156327 0.3413968 -0.3501429 -0.0907885 -0.0153112 -0.1649066 0.0043435 -0.0871515 -0.0078139 -0.0769825 -0.159197 0.4957373 -0.1719248 -0.0198716 -0.1855898 0.4047037 0.0087184 -0.1370931 0.0653647 0.2270989 -0.0190635 -0.0507345 0.1105415 0.0466352 0.0236592 -0.0784125 0.0761518 -0.1044961 -0.2425509 0.0192274 -0.0169607 0.0102088 0.0268112 0.0379544 0.0670729 -0.0134201 0.0141492 -0.0111999 0.0767476 0.0535356 0.0698443 0.0408765 -0.0300174 -0.0828915 0.0261878 -0.0646987 -0.099567 -0.151565 -0.0371522 -0.0194269 -0.0084883 0.0927277 0.0129877 0.0054125 0.0103035 0.0779432 -0.0036253 -0.0082096 0.0628535 0.0228742 0.1057355 -0.059228 0.0680751 -0.0187681 -0.0635047 0.0645394 0.0252638 -0.003914 -0.0137437 -0.1905649 0.0189418 0.0008324 0.0021719 0.0951219 0.0287103 0.0365827 -0.0798961 -0.0238952 0.0194887 -0.0275695 -0.0801781 0.0388708 -0.0937809 -0.0399686 0.1264401 0.0535157 0.0742574 -0.0951474 -0.0212696 0.1131719 -0.045485 -0.0033093 0.0475172 0.0158161 -0.0407143 0.0674468 -0.0789391 0.0839808 -0.0597548 0.072636 0.1289749 -0.0155043 0.0825036 -0.070566 0.0805741 0.0691112 0.0293918 -0.1083462 0.0583266 0.0034949 -0.012161 -0.0759053 -0.0408743 -0.0006604 -0.0434721 -0.0535823 0.0270236 -0.1051777 0.0650679 -0.0010064 0.0082109 0.0579486 -0.0395321 -0.015509 0.0842618 0.1489667 0.023207 -0.0034987 -0.0840978 0.003078 -0.0735206 0.0252748 0.0970051 0.0283561 -0.0828029 0.0198987 0.1367607 0.1250899 0.0577462 -0.0378431 0.0163645 0.0103863 0.0511276 -0.0217199 0.066905 0.1555087 unknown
polarizability: 138.2897163|8.5699155|118.6331418|8.1971781|-5.0988904|80.8629427 unknown
InChI: InChI=1S/C9H13NO3/c1-3-8(11)10-6-4-5-7(10)9(12)13-2/h3,7H,1,4-6H2,2H3
charge 0 multiplicity 1
26 atoms
O  -2.572301 1.017975 -0.481666
O  -1.459956 0.479246 1.495114
O  1.127402 1.552836 -0.731289
N  0.651079 -0.638218 -0.157534
C  -0.724104 -0.500097 -0.675082
C  -1.238414 -1.968072 -0.691893
C  -0.514031 -2.610056 0.518561
C  0.88967 -1.952978 0.499216
C  -1.577985 0.379475 0.254036
C  1.517529 0.443335 -0.233797
C  2.911373 0.225826 0.267658
C  -3.479667 1.898621 0.294645
C  3.816633 1.23684 0.260317
H  -0.72296 -0.027817 -1.670311
H  -0.921652 -2.444946 -1.637047
H  -2.336917 -2.030425 -0.626416
H  -1.035535 -2.343037 1.453689
H  -0.457864 -3.709129 0.449902
H  1.290445 -1.82027 1.519293
H  1.609297 -2.557031 -0.088642
H  3.191225 -0.768885 0.634517
H  -4.187429 2.295073 -0.446309
H  -2.899783 2.709456 0.765584
H  -3.99971 1.320754 1.0774
H  4.84295 1.096731 0.616167
H  3.521904 2.22549 -0.110614
