program: Gaussian 09
title: 000130577
version: EM64L-G09RevD.01
frameworkgroup: C1[X(C18H30N4O2)]
method: RPBEPBE
basis: SDD
operation: Freq
keyword: #p
keyword: freq=noraman
keyword: PBEPBE/SDD
title: #p freq=noraman PBEPBE/SDD
converged: YES YES NO NO
title: Mulliken charges:
elementType: O O N N N N C C C C C C C C C C C C C C C C C C H H H H H H H H H H H H H H H H H H H H H H H H H H H H H H
charge: -0.444960 -0.254202 -0.089764 -0.312893 -0.316733 -0.312700 -0.336074 -0.397028 -0.432925 -0.511967 -0.348961 -0.312399 -0.350277 -0.420192 -0.342311 -0.396387 0.465472 -0.366238 -0.376959 -0.466179 -0.393408 -0.329538 0.248854 0.105819 0.177452 0.202377 0.188303 0.223142 0.191413 0.197635 0.200070 0.218416 0.185259 0.203794 0.210587 0.173900 0.196093 0.192120 0.186881 0.211424 0.275572 0.206016 0.154410 0.218125 0.171763 0.257236 0.179192 0.209214 0.338929 0.348927 0.238551 0.283144 0.271510 0.380494
chargesum: 0.00000
title: Mulliken charges with hydrogens summed into heavy atoms:
elementType: O O N N N N C C C C C C C C C C C C C C C C C C
charge: -0.064466 -0.254202 -0.089764 -0.037321 -0.059497 0.026229 0.043755 0.014417 -0.043877 -0.093481 0.040092 0.072088 0.037936 -0.021888 0.018115 -0.006499 0.465472 0.022168 -0.028032 -0.227628 -0.110264 -0.058028 0.248854 0.105819
polarizability: 2.71693562e+02 -1.74154975e+01 2.44611934e+02 -6.01551345e+00 -1.23790673e+01 1.88532214e+02
1716.lowfreq: -11.7951 -7.7100 -0.0006 -0.0004 -0.0002 6.8389 18.6728 29.0130 39.2804
frequency: 18.1730 28.7528 39.2087 49.1929 61.4116 71.2398 75.7643 96.3098 99.3025 118.1018 135.5909 153.7532 153.8917 174.9515 198.2607 211.7309 225.9590 255.2311 260.8502 272.5616 287.2957 304.2489 317.6139 326.1393 334.5078 365.2415 381.7552 412.3043 417.7665 422.1250 476.1285 486.8106 497.2075 499.3129 527.5219 554.0641 583.0688 594.9334 625.1531 631.1583 635.8528 689.7917 712.5063 727.1083 759.6797 769.3694 809.1369 830.3850 846.5064 857.0414 858.9936 880.5297 891.9941 894.1411 900.0055 914.4859 918.4350 940.5766 956.5772 981.8154 993.3467 999.0772 1004.8608 1015.0411 1022.1888 1040.9476 1050.6545 1067.4580 1077.5220 1084.9988 1097.3801 1113.6371 1119.4327 1126.4350 1139.0517 1146.9770 1148.7531 1158.7429 1172.7899 1178.4898 1183.1973 1192.5923 1209.8270 1219.6085 1222.4274 1229.1396 1235.6390 1253.3733 1261.0940 1269.8593 1280.0476 1281.2623 1297.9632 1309.2054 1317.5648 1331.1701 1333.9077 1347.1847 1349.2360 1351.2456 1359.0253 1363.1160 1376.3118 1380.4172 1381.2917 1390.5626 1397.4665 1413.5119 1435.0893 1445.8004 1452.7338 1454.2000 1461.3172 1462.0708 1466.7850 1470.8806 1475.8523 1477.4712 1483.4100 1488.5190 1492.4251 1496.4779 1499.3580 1572.2569 1617.5199 1642.4830 2803.9510 2806.1463 2814.7474 2830.6116 2831.4418 2839.5133 2847.5475 2849.2542 2856.8852 2964.7323 2965.5706 2971.5798 2977.9427 2982.3422 2990.1495 2996.8305 3006.2522 3013.5770 3018.1176 3033.2564 3037.4013 3039.5913 3111.1378 3120.4261 3154.6953 3173.6092 3330.0706 3436.2511 3442.9040 3532.3399
redmass: 5.0535 4.8564 5.7171 4.0224 4.8244 3.0204 4.0266 3.0402 3.7922 3.6616 2.9262 4.1665 3.4641 3.1598 3.7680 3.2041 2.5139 2.6012 3.5976 3.7080 2.9211 2.4759 2.5275 2.0132 2.0227 2.8705 3.1481 2.8911 2.6597 3.8778 3.3499 2.1400 2.1295 3.9533 1.7218 2.7358 1.7164 2.2406 2.6732 2.2728 1.6423 4.1966 3.9645 2.7097 3.1441 2.0892 3.4064 2.3080 1.6734 1.6207 2.2052 1.7584 1.5579 1.3765 1.4937 1.6689 1.6521 2.1398 2.0207 1.4777 2.2721 2.5513 2.3356 2.2203 2.6057 1.8788 1.3620 2.0756 2.6679 1.9181 1.9347 1.8414 1.5075 1.8406 2.3029 2.2164 1.7263 2.0947 2.0950 3.1294 1.4343 1.1881 2.4275 1.2696 1.4217 1.2743 1.2644 1.2767 1.2337 1.2622 1.2292 1.2977 1.3620 1.4337 2.4200 1.2932 1.3170 1.6260 1.4346 1.2868 1.3982 1.4922 1.3855 1.5241 1.4815 1.4406 2.4843 2.8182 1.1655 1.1580 1.1038 1.1183 1.1176 1.1299 1.1125 1.1322 1.0916 1.1159 1.1013 1.0957 1.0881 1.0940 2.4591 7.1755 6.0876 8.4997 1.0720 1.0721 1.0710 1.0728 1.0704 1.0714 1.0714 1.0713 1.0737 1.0643 1.0767 1.0848 1.0808 1.0846 1.0762 1.0854 1.0839 1.0913 1.0882 1.0902 1.0888 1.1003 1.0936 1.0898 1.0937 1.0945 1.0762 1.0747 1.0748 1.0641
irintensity: 0.0499 0.3195 0.5759 1.3318 0.3793 0.3967 2.0199 0.9511 1.7977 0.7769 5.2823 1.7071 2.6625 0.9365 0.7090 2.9372 3.0866 0.6797 0.3435 3.1993 3.5318 2.0451 1.5322 0.8788 0.5008 2.3198 3.6707 0.2524 3.8146 22.3988 45.9026 11.1539 5.3529 8.3862 51.0995 3.5524 68.9696 48.1933 84.6348 104.4190 57.4435 38.0467 19.0602 21.5966 25.5860 35.8865 2.4356 3.3578 44.6724 17.4787 6.2516 3.5245 17.7562 1.6247 33.2667 3.4552 9.1715 14.9375 10.0156 6.6764 82.2752 107.8334 47.4579 26.7181 63.2616 16.2756 0.9455 11.8044 9.7191 22.3197 34.8741 21.5431 13.3134 1.4290 44.4798 26.0566 132.3041 39.5401 13.7123 23.5604 2.9934 9.0513 0.3736 19.3222 10.0541 4.1247 13.8095 4.7552 12.7338 6.7248 16.2382 8.5831 6.7737 41.0661 97.0647 4.1121 10.9027 2.3421 0.6682 3.4715 21.5150 1.1419 1.3520 13.9396 3.9774 1.3886 3.1562 23.5154 30.1703 3.5798 5.7762 50.5784 14.2708 16.9413 12.1783 13.0280 2.4803 26.9597 6.4566 8.0299 2.7783 12.0931 3.9681 20.4835 53.4453 287.5533 56.4744 106.8532 132.9372 143.1614 16.7063 67.6594 120.5850 355.5965 305.1758 37.5394 35.5119 31.6027 27.6423 71.6961 87.7700 33.4225 15.8617 34.3071 22.3301 84.5714 38.2818 69.9335 41.3871 15.0479 0.1724 3.8374 104.0496 2.1719 1.6739 44.1739
temp: 298.150 k
press: 1.00000 atm
elementType: 8 8 7 7 7 7 6 6 6 6 6 6 6 6 6 6 6 6 6 6 6 6 6 6 1 1 1 1 1 1 1 1 1 1 1 1 1 1 1 1 1 1 1 1 1 1 1 1 1 1 1 1 1 1
symmnumber: 1
zpe: 1223110.4 jmol-1
zpe.correction: 0.465858 hartree
zpe.thermalcorrener: 0.490204 hartree
zpe.thermalcorrenthalpy: 0.491148 hartree
zpe.thermalcorrgfe: 0.410844 hartree
zpe.sumelectzpe: -1071.451161 hartree
zpe.sumelectthermal: -1071.426815 hartree
zpe.sumelectthermalent: -1071.425871 hartree
zpe.sumelectthermalfe: -1071.506175 hartree
dipole: 2.3479 -3.6996 1.3577
dipole: 4.5873
quadrupole: -137.7313 -143.8447 -140.1429
quadrupole: 2.6796 -3.4639 3.8896
quadrupole: 2.8417 -3.2717 0.4300 2.6796 -3.4639 3.8896
hfenergy: -1071.9170193 hartree
pointgroup: C01 [X(C18H30N4O2)]
dipole: 0.6811151 -1.4011534 0.9110768 debye
polarizability: 266.5406353|-20.7495004|241.359365|-0.0797461|-24.8840222|196.9377102 unknown
InChI: InChI=1S/C18H30N4O2/c23-18(24)17-5-3-16(4-6-17)15-22-13-2-9-20-11-10-19-7-1-8-21-12-14-22/h3-6,19-21,23H,1-2,7-15H2
charge 0 multiplicity 1
54 atoms
O  -5.593019 1.319135 -0.590989
O  -3.98006 2.64376 -1.605423
N  0.855385 -1.888212 1.157545
N  1.564076 0.975784 1.788323
N  2.049235 -1.087814 -1.866284
N  2.413436 1.67742 -0.971143
C  2.039843 -2.763227 1.050771
C  0.695734 -1.263679 2.489043
C  2.546237 -3.061692 -0.381289
C  -0.397186 -2.480411 0.646716
C  1.672433 -0.104643 2.782707
C  3.105796 -1.865155 -1.185836
C  2.246414 2.238724 2.142424
C  2.229562 3.247433 0.971996
C  3.051068 2.801943 -0.257058
C  2.511057 -0.025669 -2.788195
C  -1.421202 -1.419206 0.252154
C  3.237086 1.119558 -2.052978
C  -0.998147 -0.271139 -0.472107
C  -2.793238 -1.571387 0.573475
C  -1.935012 0.702958 -0.863281
C  -3.736936 -0.599764 0.180806
C  -3.311012 0.545413 -0.54034
C  -4.264328 1.597998 -0.970363
H  1.863503 -3.747637 1.564521
H  2.863633 -2.272356 1.601703
H  0.791842 -2.013785 3.31677
H  -0.334972 -0.863122 2.547476
H  1.760302 -3.569986 -0.978928
H  3.358758 -3.808196 -0.270364
H  -0.863735 -3.197439 1.371283
H  -0.146584 -3.075145 -0.252821
H  1.44977 0.245139 3.8247
H  2.720919 -0.467443 2.799797
H  3.655351 -1.192867 -0.497821
H  3.861423 -2.254604 -1.917791
H  3.299158 1.994464 2.394884
H  1.807533 2.719789 3.054065
H  2.632413 4.210522 1.342974
H  1.183891 3.434904 0.653174
H  0.592175 1.126203 1.483587
H  3.14784 3.657343 -0.958094
H  4.093764 2.557001 0.085255
H  1.616632 0.391189 -3.287132
H  3.202455 -0.414015 -3.580533
H  1.35921 -1.704583 -2.315039
H  4.236933 0.755003 -1.692897
H  3.455143 1.913932 -2.796462
H  2.113837 0.949807 -0.297031
H  0.067747 -0.171788 -0.714989
H  -3.12278 -2.451651 1.139425
H  -1.620876 1.591013 -1.422006
H  -4.796188 -0.710636 0.429108
H  -6.170121 2.062514 -0.912691
