program: Gaussian 09
title: 000130473
version: EM64L-G09RevD.01
frameworkgroup: C1[X(C5H7NO4S2)]
method: RPBEPBE
basis: SDD
operation: Freq
keyword: #p
keyword: freq=noraman
keyword: PBEPBE/SDD
title: #p freq=noraman PBEPBE/SDD
converged: NO YES NO NO
title: Mulliken charges:
elementType: S S O O O O N C C C C C H H H H H H H
charge: 0.027132 0.054465 -0.414615 -0.411321 -0.217648 -0.212127 0.049331 -0.451851 -0.479741 -0.526264 0.225809 0.227711 0.290348 0.296429 0.291872 0.298167 0.168203 0.390487 0.393612
chargesum: 0.00000
title: Mulliken charges with hydrogens summed into heavy atoms:
elementType: S S O O O O N C C C C C
charge: 0.195336 0.054465 -0.024128 -0.017709 -0.217648 -0.212127 0.049331 0.134926 0.110298 -0.526264 0.225809 0.227711
polarizability: 1.22309342e+02 4.19223641e+00 1.15433702e+02 1.94317472e+01 5.40118690e+00 8.40502957e+01
1716.lowfreq: -9.2298 -6.9848 -5.3297 -0.0028 -0.0028 -0.0009 13.8583 37.6465 39.1354
frequency: 12.5603 37.6138 39.0541 45.2828 54.1762 96.2350 184.8292 266.3646 295.4110 322.3469 326.5595 342.6428 347.3346 404.1032 477.2310 484.7490 524.7272 531.3320 539.8347 605.0748 633.8859 657.8154 670.0648 795.4338 816.0659 845.8764 913.0119 950.9460 968.7133 1036.8862 1076.5528 1083.1191 1180.1723 1228.4261 1263.9313 1295.7646 1315.3184 1326.5380 1349.5839 1407.8599 1436.4786 1470.9283 1668.8908 1672.5799 2475.6962 3009.7262 3020.9568 3070.3027 3082.4347 3517.6552 3519.0149
redmass: 9.7239 10.5795 8.8642 7.4752 15.2551 6.5170 7.2087 4.7415 7.9438 1.1565 4.7369 6.6399 4.9914 3.5479 1.9567 2.1995 4.6820 6.1054 3.8069 2.8684 2.1423 1.6872 2.4502 5.8531 5.5900 1.2854 3.5893 2.3159 3.4294 2.8499 2.2838 2.2005 2.0196 1.3722 1.9446 2.4186 2.2415 1.3294 1.2787 1.6260 1.3184 1.2972 9.3613 9.3290 1.0377 1.0602 1.0625 1.1004 1.0996 1.0641 1.0642
irintensity: 1.7597 3.0594 0.3342 0.0336 0.3233 0.5334 0.0412 0.6183 4.0528 38.0090 4.0361 2.4466 5.2067 1.6004 26.5788 18.5904 70.7951 11.3332 37.1219 85.7671 76.7843 66.7928 100.9247 0.5505 32.7192 34.8464 60.8451 23.0118 83.1204 51.8584 192.6288 193.7341 49.0926 99.5919 29.1462 2.8818 65.0139 10.1387 3.3040 89.1727 74.1329 86.6303 485.5498 76.9467 1.5546 29.3081 11.8612 6.5864 0.2666 38.3532 34.7519
temp: 298.150 k
press: 1.00000 atm
elementType: 16 16 8 8 8 8 7 6 6 6 6 6 1 1 1 1 1 1 1
symmnumber: 1
zpe: 327167.2 jmol-1
zpe.correction: 0.124611 hartree
zpe.thermalcorrener: 0.137978 hartree
zpe.thermalcorrenthalpy: 0.138922 hartree
zpe.thermalcorrgfe: 0.080629 hartree
zpe.sumelectzpe: -1345.576345 hartree
zpe.sumelectthermal: -1345.562978 hartree
zpe.sumelectthermalent: -1345.562034 hartree
zpe.sumelectthermalfe: -1345.620327 hartree
dipole: -0.9605 -2.1129 -0.7611
dipole: 2.4426
quadrupole: -96.7343 -84.6172 -78.3880
quadrupole: -5.0811 -12.6113 -3.9883
quadrupole: -10.1545 1.9626 8.1918 -5.0811 -12.6113 -3.9883
hfenergy: -1345.7009559 hartree
pointgroup: C01 [X(C5H7N1O4S2)]
dipole: -0.4613155 0.7699051 0.3434423 debye
dipolederiv: -0.5107934 -0.3100583 0.2576051 -0.2425439 -0.0898185 0.1488239 0.2897508 0.2119247 -0.2907688 -0.5903647 0.1992837 0.2687733 0.1896329 -0.5554599 -0.1393132 0.3186079 -0.1495075 -0.3651363 -0.3525874 -0.0272085 0.0256564 0.0406265 -0.370547 0.0204101 0.0722541 0.0069638 -1.1624696 -0.3459457 0.0323162 0.0306344 -0.0345424 -0.3925503 0.0473261 0.0636431 0.091448 -1.1475759 -0.8661042 -0.3901222 0.2689166 -0.2990845 -0.5138377 0.1414377 0.037105 0.0262852 -0.6283631 -0.9103074 0.3287937 0.3111118 0.2268015 -0.4200744 -0.092325 0.0485962 0.0085305 -0.6324908 -0.5426124 -0.0567723 0.1064521 0.1090643 -1.3681486 -0.1072036 0.1566305 -0.0144521 -0.3101697 0.1670655 0.2438631 -0.0730908 0.0886057 0.1443318 -0.0471112 -0.215293 -0.3866878 0.0392798 0.1606566 -0.2059194 -0.0877765 -0.1953085 0.2540678 0.0484695 -0.1653026 0.2571954 0.09614 0.8826316 0.0035898 -0.6979378 -0.126853 1.5764101 0.1319698 -0.7191434 0.0529197 0.3128085 1.1330687 0.5687548 -0.1880105 0.4573991 0.4646311 -0.0942226 -0.0412138 0.0252684 1.4226515 1.1860981 -0.4560235 -0.2245648 -0.3138506 0.3406824 -0.0155259 -0.0711091 -0.1520679 1.4060924 0.07552 -0.0179721 -0.042401 -0.0118145 -0.0327557 0.0564156 0.0069473 0.0615982 0.1213389 0.0347301 -0.0392739 0.0311571 0.077876 0.2019172 -0.1088431 0.0481671 0.0143518 0.103495 0.0862056 -0.0076304 -0.0307179 0.0176155 -0.0452748 -0.0368519 0.0235107 -0.0214154 0.1248345 0.0353566 0.0373343 0.0458287 0.0041119 0.0930613 0.0784241 0.0348799 0.039562 0.0660738 0.0968171 0.1197941 0.058489 0.0428263 0.0233657 -0.0246746 0.0664162 -0.0710299 0.1648469 0.1394996 -0.1113484 -0.0317981 -0.102674 0.328789 -0.0216497 0.0195925 0.0158767 0.3400294 0.1210657 0.0885992 -0.0283271 0.0721117 0.3612105 0.0144439 0.0259606 -0.0167638 0.3393835 unknown
polarizability: 119.4372768|-2.7945898|114.4000998|-23.1929375|2.9416253|87.9559634 unknown
InChI: InChI=1S/C5H7NO4S2/c7-3(8)1-6(5(11)12)2-4(9)10/h7,9,11H,1-2H2
charge 0 multiplicity 1
19 atoms
S  -1.407444 -2.456701 0.898671
S  1.145158 -2.705238 -0.850713
O  2.053233 0.844256 1.362026
O  -2.008458 0.908556 -1.353277
O  3.23058 1.440534 -0.55355
O  -3.260245 1.211282 0.585814
N  0.031965 -0.344518 -0.007924
C  1.022306 0.395193 -0.802498
C  -0.923087 0.455592 0.77247
C  0.015675 -1.72377 -0.038924
C  2.221626 0.935086 -0.024306
C  -2.196388 0.875741 0.030479
H  0.523357 1.24167 -1.309415
H  1.41901 -0.273499 -1.586339
H  -0.411768 1.372622 1.118024
H  -1.22902 -0.077581 1.68789
H  -0.996881 -3.750087 0.64809
H  2.869701 1.188309 1.816715
H  -2.852919 1.187653 -1.800835
