program: Gaussian 09
title: 000130498
version: EM64L-G09RevD.01
frameworkgroup: C1[X(C9H18N2O3S)]
method: RPBEPBE
basis: SDD
operation: Freq
keyword: #p
keyword: freq=noraman
keyword: PBEPBE/SDD
title: #p freq=noraman PBEPBE/SDD
converged: YES YES NO NO
title: Mulliken charges:
elementType: S O O O N N C C C C C C C C C H H H H H H H H H H H H H H H H H H
charge: -0.031407 -0.291052 -0.441190 -0.228300 -0.389995 -0.297221 0.169337 0.220068 -0.750834 -0.696619 -0.699363 -0.421244 -0.071963 -0.760584 0.192490 0.199023 0.231036 0.215665 0.211139 0.253017 0.208496 0.255269 0.208216 0.206829 0.277776 0.232411 0.366457 0.260633 0.293650 0.295958 0.274930 0.126574 0.380798
chargesum: 0.00000
title: Mulliken charges with hydrogens summed into heavy atoms:
elementType: S O O O N N C C C C C C C C C
charge: 0.095167 -0.291052 -0.060392 -0.228300 -0.023538 -0.003571 0.169337 0.220068 -0.105110 -0.023966 -0.029050 0.088942 0.188670 -0.189696 0.192490
polarizability: 1.75103013e+02 -5.59754801e+00 1.32410784e+02 2.74138182e+00 4.08265798e-01 1.11547416e+02
1716.lowfreq: -10.6995 0.0005 0.0019 0.0020 4.4811 10.7145 20.7985 26.7989 35.0687
frequency: 17.2381 26.5734 34.6769 43.3564 77.6583 84.7579 119.3866 137.3850 185.7757 196.0538 209.0224 231.6488 257.8195 262.1229 266.4859 274.7829 289.1483 299.2828 337.3073 347.0601 363.0014 384.3449 443.4818 473.8966 509.0086 552.0721 565.1449 581.5286 606.4596 649.9934 678.9840 710.9295 731.1762 746.7445 766.4037 821.0449 846.7887 924.4026 933.2103 949.9121 966.1029 990.5971 998.7127 1014.7770 1021.7045 1030.0758 1079.9068 1103.9941 1139.6332 1183.1584 1187.7761 1207.6173 1234.4930 1237.8901 1243.4505 1267.0008 1286.1241 1323.2302 1349.7728 1366.8408 1369.4657 1374.3139 1398.4355 1429.7440 1442.7647 1455.1934 1459.0101 1465.8539 1472.5618 1476.4127 1486.8297 1490.1693 1501.2661 1593.6446 1652.2356 2438.5024 2962.6892 2977.1025 2980.1755 3014.4254 3044.9365 3053.1169 3055.1737 3067.8414 3069.5831 3075.6349 3090.1109 3095.4619 3101.8200 3134.2764 3498.4354 3504.4970 3547.7145
redmass: 4.4491 4.6764 6.0304 5.1766 6.3619 6.0114 4.5119 7.3036 2.7788 3.2244 1.1884 2.4046 1.3247 2.3794 1.3360 1.9989 1.1669 3.0223 4.4685 2.7727 2.2996 2.3506 4.0745 3.6925 1.5095 2.6030 2.6052 1.9796 1.5695 1.8635 2.6487 2.7054 6.3494 2.1208 3.4796 1.7384 2.4452 1.6772 1.5595 1.2357 2.7552 3.8815 1.8149 2.8784 1.4497 1.6880 2.7185 1.9210 3.8427 2.3748 1.3744 2.9994 2.1037 1.5166 1.3644 2.2792 1.3299 1.4057 1.3982 1.1842 1.1974 1.1851 1.2098 1.0903 1.1046 1.0499 1.2562 1.1450 1.0505 1.0884 1.2332 1.2113 1.0612 6.3956 8.0462 1.0380 1.0361 1.0349 1.0358 1.0612 1.0789 1.0651 1.0996 1.0987 1.1004 1.0987 1.1033 1.1001 1.0992 1.1066 1.0640 1.0757 1.0776
irintensity: 1.5265 0.5501 1.6615 6.2111 0.3763 1.0086 1.4426 0.9060 2.8791 2.3743 0.3938 6.2377 28.8109 9.9105 5.8011 1.0296 0.2078 6.4637 15.0502 4.3532 1.8300 2.8885 25.4975 6.3039 73.6813 94.3629 66.7266 64.7081 153.3483 72.8835 18.2347 58.4910 1.9669 2.7224 1.4987 6.9742 19.7904 3.0596 2.9364 0.6837 15.3164 17.4541 12.8040 133.1668 10.1350 21.3658 164.0037 12.6991 207.9104 68.8759 13.5788 5.6082 13.3492 12.1088 0.5872 16.2995 31.7946 25.1490 8.1505 19.4620 25.0817 14.7381 15.0448 23.2723 11.7943 1.0904 113.8028 25.3521 3.2485 52.7145 98.2731 95.1553 20.0353 147.2578 199.4632 10.0383 31.0105 38.1132 22.3373 38.4066 2.7836 13.1137 32.6889 6.6118 30.9601 85.5721 1.7835 7.6099 23.3646 3.1827 21.2269 6.1642 44.5502
temp: 298.150 k
press: 1.00000 atm
elementType: 16 8 8 8 7 7 6 6 6 6 6 6 6 6 6 1 1 1 1 1 1 1 1 1 1 1 1 1 1 1 1 1 1
symmnumber: 1
zpe: 705487.7 jmol-1
zpe.correction: 0.268706 hartree
zpe.thermalcorrener: 0.287171 hartree
zpe.thermalcorrenthalpy: 0.288115 hartree
zpe.thermalcorrgfe: 0.220210 hartree
zpe.sumelectzpe: -1085.794773 hartree
zpe.sumelectthermal: -1085.776308 hartree
zpe.sumelectthermalent: -1085.775364 hartree
zpe.sumelectthermalfe: -1085.843269 hartree
dipole: 0.8607 2.6791 -1.7068
dipole: 3.2911
quadrupole: -113.8199 -99.0341 -100.7424
quadrupole: 10.6160 -4.6942 0.2153
quadrupole: -9.2878 5.4980 3.7897 10.6160 -4.6942 0.2153
hfenergy: -1086.0634791 hartree
pointgroup: C01 [X(C9H18N2O3S1)]
dipole: 0.2771011 -0.1755013 1.2525887 debye
polarizability: 171.9524821|14.0453567|125.5136484|0.9487057|-10.2833694|121.5950827 unknown
InChI: InChI=1S/C9H18N2O3S/c1-9(2,3)8(14)11-5-10-6(4-15)7(12)13/h6,10-12,15H,4-5H2,1-3H3
charge 0 multiplicity 1
33 atoms
S  -4.985084 -1.45995 -0.29346
O  2.385136 0.900712 -1.677077
O  -1.152043 -1.173429 1.514839
O  -1.846426 -2.82331 0.034815
N  0.771599 0.640588 -0.02819
N  -1.261477 0.111612 -1.380513
C  3.15413 -0.010919 0.475712
C  2.074459 0.541666 -0.497005
C  2.595961 -0.471349 1.845273
C  4.193498 1.128505 0.688038
C  3.844549 -1.207171 -0.238799
C  -0.327544 1.126631 -0.891387
C  -2.313165 -0.426712 -0.502299
C  -3.527133 -0.861861 -1.343818
C  -1.796762 -1.611056 0.340194
H  1.862401 -1.294031 1.735583
H  3.424351 -0.856691 2.466983
H  2.126714 0.359085 2.406976
H  3.743003 1.992478 1.211028
H  4.578051 1.475302 -0.286015
H  5.040885 0.759178 1.295107
H  4.218041 -0.892141 -1.227384
H  3.141469 -2.048224 -0.387197
H  4.695046 -1.570223 0.367386
H  0.161743 1.602979 -1.75723
H  -0.909509 1.88596 -0.338082
H  0.524298 0.288623 0.898511
H  -2.617549 0.372952 0.196076
H  -0.870435 -0.554128 -2.055034
H  -3.901339 0.006066 -1.906901
H  -3.257216 -1.664832 -2.048492
H  -4.481155 -2.728853 -0.059486
H  -0.813695 -1.964356 2.017747
