program: Gaussian 09
title: 000143352
version: EM64L-G09RevD.01
frameworkgroup: C1[X(C15H10N2O3)]
method: RPBEPBE
basis: SDD
operation: Freq
keyword: #p
keyword: freq=noraman
keyword: PBEPBE/SDD
title: #p freq=noraman PBEPBE/SDD
converged: YES YES NO NO
title: Mulliken charges:
elementType: O O O N N C C C C C C C C C C C C C C C H H H H H H H H H H
charge: -0.282590 -0.198141 -0.196347 -0.141193 0.024620 0.381384 0.158698 0.440092 -0.405556 -0.385288 0.076916 -0.382827 -0.358270 -0.325494 -0.325372 -0.231545 -0.229883 -0.356884 -0.356757 0.397079 0.277137 0.282375 0.229879 0.284873 0.277222 0.284595 0.233345 0.235870 0.295494 0.296566
chargesum: 0.00000
title: Mulliken charges with hydrogens summed into heavy atoms:
elementType: O O O N N C C C C C C C C C C C C C C C
charge: -0.282590 -0.198141 -0.196347 -0.141193 0.024620 0.381384 0.158698 0.440092 -0.128419 -0.102912 0.076916 -0.152948 -0.073397 -0.048272 -0.040777 0.001800 0.005988 -0.061390 -0.060191 0.397079
polarizability: 4.32272126e+02 -5.90298852e+00 1.97640103e+02 -4.38023892e-01 5.82858800e+00 9.48615917e+01
1716.lowfreq: -10.2566 -4.7430 -0.0004 0.0005 0.0005 1.9542 30.8708 38.4986 56.3709
frequency: 30.7069 38.4957 56.3618 69.5376 110.7803 144.0614 177.4970 201.4063 204.9594 249.5448 273.2396 322.5224 353.8494 412.7687 421.2745 427.6465 458.3921 491.7222 502.9202 518.0500 529.3989 585.9997 595.3009 607.1690 629.4297 651.3388 664.7561 678.6761 723.5888 732.4861 739.4145 764.9939 785.2662 792.8877 806.1958 842.6507 848.6696 871.0168 889.0216 925.5877 978.4713 985.5582 994.5591 1003.6911 1008.5443 1017.2869 1060.8843 1092.0029 1097.0210 1110.8017 1137.2536 1171.5279 1175.8677 1212.0092 1214.5147 1253.1152 1258.5324 1292.8164 1299.0625 1353.2821 1369.8102 1390.8709 1405.6692 1407.6062 1429.2868 1432.9544 1467.7754 1477.4962 1503.6165 1541.1188 1564.6677 1602.9120 1605.3700 1617.7800 3125.0236 3139.9896 3154.7846 3162.7775 3165.1655 3168.3855 3187.9604 3190.4334 3198.3297 3205.2864
redmass: 6.7742 7.3502 6.7447 6.0740 5.8054 7.2249 4.9485 6.3844 9.6020 5.2046 6.3056 6.6552 5.1263 2.9613 8.6001 3.4212 4.7025 6.1246 6.5381 3.5749 6.7625 5.0677 6.5483 4.5955 3.4200 3.9955 4.4860 8.0252 1.5161 3.3288 4.7731 2.0399 8.8723 1.6030 2.0478 2.1009 1.7922 1.7686 1.5094 5.4766 1.3663 1.3353 1.3606 3.0442 1.3394 2.5759 2.9927 3.2330 2.6735 1.2732 1.6964 1.0864 1.3100 2.0458 5.7819 1.8584 1.8616 1.3110 2.2514 2.3947 5.3062 8.6274 7.3446 6.6778 2.5080 3.4513 2.9442 2.5466 7.0310 4.4235 7.1328 8.2733 6.4033 6.4046 1.0869 1.0893 1.0943 1.0908 1.0909 1.1001 1.0954 1.0965 1.0913 1.0942
irintensity: 0.4172 2.5327 2.4002 0.3149 6.0877 1.0291 1.7590 2.7219 0.5909 0.1670 3.8828 0.3348 3.1584 0.1632 3.5736 3.5886 1.1189 0.8264 0.6610 10.1651 17.3398 2.4840 1.4482 5.3743 1.7741 0.3702 25.0589 3.3119 1.8474 2.3006 9.5865 14.1021 24.4098 68.6969 81.7861 8.2538 3.3191 54.3431 1.2502 5.7689 2.1677 4.0757 0.5178 4.7042 1.2240 12.9728 6.1722 14.8162 35.4135 19.2802 18.0918 5.0713 118.6238 62.7476 581.5242 12.3035 3.1500 0.6402 15.9867 7.1905 80.9405 33.4832 3.8549 13.2297 16.2003 70.7156 3.7922 34.8007 130.0543 48.6295 106.3223 11.5397 143.2281 3.5059 1.7422 11.4734 10.3091 1.0800 0.1697 39.2298 1.7575 6.3898 4.8684 0.1250
temp: 298.150 k
press: 1.00000 atm
elementType: 8 8 8 7 7 6 6 6 6 6 6 6 6 6 6 6 6 6 6 6 1 1 1 1 1 1 1 1 1 1
symmnumber: 1
zpe: 570388.2 jmol-1
zpe.correction: 0.217249 hartree
zpe.thermalcorrener: 0.232690 hartree
zpe.thermalcorrenthalpy: 0.233634 hartree
zpe.thermalcorrgfe: 0.173008 hartree
zpe.sumelectzpe: -911.307656 hartree
zpe.sumelectthermal: -911.292216 hartree
zpe.sumelectthermalent: -911.291271 hartree
zpe.sumelectthermalfe: -911.351897 hartree
dipole: 1.3271 -4.7384 0.9602
dipole: 5.0135
quadrupole: -145.2254 -118.7656 -115.8662
quadrupole: -19.8249 3.7420 3.8095
quadrupole: -18.6063 7.8535 10.7529 -19.8249 3.7420 3.8095
hfenergy: -911.5249052 hartree
pointgroup: C01 [X(C15H10N2O3)]
dipole: -0.5340485 -1.8417952 -0.4618092 debye
polarizability: 432.3150672|4.7100309|197.9055228|-1.9839375|-1.0184625|94.5532305 unknown
InChI: InChI=1S/C15H10N2O3/c18-15-10-16(9-11-3-1-2-4-14(11)15)12-5-7-13(8-6-12)17(19)20/h1-10H
charge 0 multiplicity 1
30 atoms
O  -2.898797 2.795781 0.71041
O  5.849218 -1.232555 0.564021
O  5.965444 0.642418 -0.732819
N  -0.402226 0.20787 0.082246
N  5.307935 -0.245932 -0.067504
C  -2.576808 -0.816628 -0.176869
C  -3.208339 0.441642 0.134822
C  1.050768 0.091325 0.04159
C  -1.15549 -0.908689 -0.199354
C  -0.957118 1.436776 0.390988
C  -2.388453 1.647756 0.430155
C  -3.398063 -1.956537 -0.471262
C  -4.624933 0.527806 0.155652
C  1.68419 -0.964392 0.739191
C  1.805398 1.042705 -0.68397
C  -4.791807 -1.845858 -0.44526
C  -5.411974 -0.598797 -0.128197
C  3.086083 -1.079781 0.703448
C  3.207859 0.935794 -0.721396
C  3.826731 -0.126596 -0.02767
H  -0.620313 -1.812422 -0.490387
H  -0.274777 2.244181 0.659334
H  -2.92156 -2.913517 -0.71522
H  -5.067084 1.499855 0.398085
H  1.085337 -1.668843 1.324027
H  1.294355 1.842031 -1.228533
H  -5.41381 -2.719412 -0.668883
H  -6.504703 -0.526939 -0.110085
H  3.611075 -1.876924 1.235589
H  3.822561 1.645882 -1.280048
